program: Orca
programVersion: 5.0.2
elementType: O O O N N C C C C C C C C C C C C C C C C C H H H H H H H H H H H H H H H H H H H H
charge: 0
multiplicity: 1
keywords: wb97x-d3
keywords: def2-TZVPP
keywords: def2/J RIJCOSX
keywords: DEFGRID2
keywords: scfconv7
keywords: smallprint printgap noloewdin
keywords: NOSOSCF
formula: C17H20N2O3
InChI: InChI=1/C17H20N2O3/c1-12(2)22-17(20)19-18-15-11-14(9-10-16(15)21-3)13-7-5-4-6-8-13/h4-12,18-19H,1-3H3
42 atoms
O  2.021675 -2.643673 0.912697
O  2.188524 3.280239 -0.582595
O  2.475143 -1.769369 -1.123789
N  2.138964 0.71291 0.047867
N  2.167491 -0.460515 0.727052
C  -1.494166 1.409121 -0.20402
C  0.933304 1.370976 -0.129155
C  -0.288967 0.734365 0.005975
C  -2.77611 0.696683 -0.046583
C  0.953989 2.732413 -0.485993
C  -1.452885 2.748059 -0.558624
C  -0.234487 3.404855 -0.696977
C  2.087537 -3.990519 0.420061
C  -2.960606 -0.225264 0.983738
C  -3.836264 0.923263 -0.92385
C  3.527457 -4.465515 0.36708
C  1.235703 -4.823325 1.356787
C  -4.161158 -0.900563 1.130739
C  -5.039665 0.252698 -0.775348
C  -5.207792 -0.663812 0.252078
C  2.24001 -1.648584 0.044686
C  2.293806 4.637285 -0.92385
H  -0.313538 -0.321261 0.241931
H  -2.370092 3.3044 -0.698763
H  -0.235154 4.453892 -0.960189
H  1.660315 -4.019609 -0.585336
H  2.964444 1.279512 0.138318
H  -2.161709 -0.399408 1.693727
H  -3.706565 1.612446 -1.748792
H  3.990447 -4.426033 1.354326
H  3.564701 -5.499074 0.021381
H  4.120053 -3.866274 -0.322358
H  1.22512 -5.861241 1.0246
H  0.204934 -4.46969 1.377358
H  1.626632 -4.802609 2.375096
H  1.843075 -0.474404 1.685053
H  -4.282426 -1.608123 1.940685
H  -5.845664 0.438579 -1.473217
H  -6.145965 -1.190529 0.365862
H  1.810002 5.286458 -0.187082
H  1.867263 4.847096 -1.909435
H  3.355614 4.871804 -0.949085
totalener: -995.11474235 hartree
nucrepener: 1732.60053584 hartree
electener: -2727.71527820 hartree
oneelecener: -4794.29222400 hartree
twoeener: 2066.57694580 hartree
kineticenergy: 990.84025989 hartree
xcener: -96.159563007502 hartree
chargesum: -0.0000000
charge: -0.322475 -0.326661 -0.373546 -0.079467 -0.188784 0.138476 0.033707 -0.180713 0.097834 0.263907 -0.230554 -0.161099 0.137418 -0.192308 -0.185922 -0.250779 -0.231209 -0.135215 -0.135615 -0.117147 0.444060 -0.145103 0.118307 0.116478 0.106003 0.067315 0.144668 0.117200 0.121122 0.079462 0.081026 0.104853 0.077991 0.090912 0.080675 0.153774 0.120276 0.121694 0.122960 0.100416 0.103365 0.112698
qa: -0.3225 -0.3267 -0.3735 -0.0795 -0.1888 0.1385 0.0337 -0.1807 0.0978 0.2639 -0.2306 -0.1611 0.1374 -0.1923 -0.1859 -0.2508 -0.2312 -0.1352 -0.1356 -0.1171 0.4441 -0.1451 0.1183 0.1165 0.1060 0.0673 0.1447 0.1172 0.1211 0.0795 0.0810 0.1049 0.0780 0.0909 0.0807 0.1538 0.1203 0.1217 0.1230 0.1004 0.1034 0.1127
va: 2.0731 2.0506 2.1492 3.0857 3.1511 3.6970 4.1653 3.9372 3.6090 3.8930 4.0643 3.9382 3.8750 3.9815 3.9880 3.9034 3.9314 3.9759 3.9777 3.9576 4.3885 3.9166 1.0288 1.0126 1.0177 1.0220 1.0450 1.0130 1.0122 1.0087 1.0099 1.0180 1.0088 1.0108 1.0090 1.0367 1.0035 1.0034 1.0004 0.9860 0.9863 0.9980
dispcorr: -0.017042907 hartree
energy: -995.131785259868
dipole: 3.08818 -2.93477 0.15341 -10.23979 10.70895 0.46916 3.20711 -2.34304 0.86407
magnitude: 0.99512 au
magnitude: 2.52938 debye
