program: Gaussian 09
title: 000006670
version: EM64L-G09RevD.01
frameworkgroup: C1[X(C10H9NO3S)]
method: RPBEPBE
basis: SDD
operation: Freq
keyword: #p
keyword: freq=noraman
keyword: PBEPBE/SDD
title: #p freq=noraman PBEPBE/SDD
converged: YES YES NO NO
title: Mulliken charges:
elementType: S O O O N C C C C C C C C C C H H H H H H H H H
charge: 0.952501 -0.556102 -0.543471 -0.497375 -0.689467 0.436194 -0.449712 0.434434 0.541507 -0.447315 -0.360246 -0.428299 -0.427279 -0.248851 -0.249365 0.243193 0.275372 0.229864 0.245176 0.232377 0.233852 0.316112 0.379414 0.377485
chargesum: 0.00000
title: Mulliken charges with hydrogens summed into heavy atoms:
elementType: S O O O N C C C C C C C C C C
charge: 0.952501 -0.178617 -0.543471 -0.497375 0.006059 0.436194 -0.449712 0.434434 0.541507 -0.204122 -0.084874 -0.198435 -0.182103 -0.016474 -0.015512
polarizability: 2.10263740e+02 -1.89675390e+01 1.87431985e+02 9.45640606e-01 1.03493962e+00 7.60122299e+01
1716.lowfreq: 0.0011 0.0023 0.0028 1.5314 5.7880 11.7134 43.0115 70.5351 118.3007
frequency: 42.9942 70.5140 118.2980 150.5162 175.0609 181.6868 222.1655 254.2686 273.9402 296.0184 314.5159 340.5883 347.4874 407.8397 422.5294 437.4934 465.5750 496.8977 515.1627 524.5211 541.7725 552.4553 633.8711 664.3530 730.9191 754.8632 760.1185 786.7963 792.5155 812.7094 826.1529 878.3264 901.0693 929.3925 953.5816 969.3405 981.1114 992.2886 1038.9584 1042.1897 1099.3435 1127.0701 1170.9934 1183.7002 1237.0380 1271.3928 1323.2594 1359.9908 1395.8157 1415.9289 1438.3257 1491.7677 1511.4859 1562.2925 1612.2979 1627.7549 1649.7570 3125.2277 3127.0011 3140.7917 3150.3538 3163.4529 3181.2371 3336.3257 3468.4780 3639.7822
redmass: 7.8726 5.0226 4.8361 5.5560 2.1319 7.3223 5.1540 2.2843 9.8339 6.1969 4.6360 5.9636 5.0531 3.2481 6.4922 7.7816 1.1459 5.4000 4.5516 4.5171 3.2202 6.6269 6.8035 2.8694 6.1529 1.1795 1.3114 6.0256 3.0579 9.2536 1.5312 1.7510 5.7855 9.1989 1.3810 3.8064 1.4230 1.3602 1.3529 1.8364 1.9532 1.7155 1.1437 1.1387 1.8784 1.7987 2.5403 1.8358 5.2038 2.8782 2.8278 3.0613 4.0393 6.2475 3.2454 1.8885 3.0857 1.0874 1.0867 1.0899 1.0983 1.0971 1.0962 1.0617 1.0660 1.0902
irintensity: 0.5040 0.5487 3.9953 7.2836 24.2438 3.7060 0.9829 41.1119 3.0507 19.2908 28.9891 9.9770 2.0327 4.1577 21.1824 40.6806 86.1473 56.2605 74.5987 10.7205 3.1794 73.5264 10.9443 8.1546 1.7985 145.1427 43.9316 10.3130 26.3997 66.4906 81.1648 5.0413 1.0064 81.9152 2.6013 7.1477 1.7174 0.1552 53.1565 28.1233 4.7521 7.5800 14.6526 1.0735 17.0279 6.9127 18.9983 24.1272 19.7212 8.5068 23.1318 7.1289 62.3170 30.9254 8.5656 22.4276 384.9755 1.2533 5.0119 12.3459 22.7571 23.5104 8.2895 134.0301 39.3742 74.9726
temp: 298.150 k
press: 1.00000 atm
elementType: 16 8 8 8 7 6 6 6 6 6 6 6 6 6 6 1 1 1 1 1 1 1 1 1
symmnumber: 1
zpe: 451062.3 jmol-1
zpe.correction: 0.171801 hartree
zpe.thermalcorrener: 0.185401 hartree
zpe.thermalcorrenthalpy: 0.186345 hartree
zpe.thermalcorrgfe: 0.131927 hartree
zpe.sumelectzpe: -1063.718408 hartree
zpe.sumelectthermal: -1063.704808 hartree
zpe.sumelectthermalent: -1063.703864 hartree
zpe.sumelectthermalfe: -1063.758282 hartree
dipole: 2.5728 3.5758 1.2380
dipole: 4.5758
quadrupole: -89.4172 -75.6386 -103.6855
quadrupole: -4.0207 -4.6673 -5.0277
quadrupole: 0.1632 13.9418 -14.1051 -4.0207 -4.6673 -5.0277
hfenergy: -1063.8902086 hartree
pointgroup: C01 [X(C10H9N1O3S1)]
dipole: -0.8747274 -1.5161799 0.4207255 debye
dipolederiv: 1.535094 0.331277 0.0116701 0.4713727 1.6153726 0.1415144 0.2329835 0.3299972 1.5936886 -0.5032508 0.0201091 -0.0869041 -0.0719657 -0.5840538 -0.2759354 -0.2741068 -0.3966378 -0.9456714 -0.8092502 0.0349826 0.0495641 0.0130039 -0.5851385 -0.0409613 -0.0106692 -0.0150073 -0.4864863 -0.5536061 -0.0702515 -0.0430985 -0.1117079 -0.6669295 0.1242564 -0.0276534 0.0286692 -0.5468186 -1.2987666 0.6860664 -0.0153808 0.2942072 -0.4727277 -0.0111735 -0.048076 0.0212131 -0.6076076 0.4221069 0.0722877 0.0039705 -0.5659284 -0.1152259 -0.0156908 -0.0010863 -0.0008777 0.0725631 -0.4345666 -0.0582194 -0.0073254 0.3204485 -0.5287029 -0.0048569 0.0854853 0.1184785 -0.2604596 -0.1912221 0.0124671 -0.0055345 0.1036003 -0.3623255 0.0002953 -0.016543 -0.0187042 0.0298091 1.112062 -0.9354159 0.018253 -0.1655899 0.4411593 0.0035789 0.0110486 -0.030094 0.1603618 0.3010076 -0.1997207 0.00264 -0.1655877 0.3987022 0.0000022 0.0055476 0.0048153 -0.1074154 -0.1991299 0.0281095 0.0013517 0.2586769 0.0413535 0.0138736 0.0214709 -0.012785 -0.1213637 -0.4805139 0.3230935 -0.0053496 -0.1863665 0.1227946 -0.0090816 0.0039828 -0.0106114 -0.1936474 0.1435467 -0.1214349 -0.0022355 0.0358536 0.1616282 0.0005097 0.0015126 0.0054114 -0.1624736 0.0708577 0.1070497 0.0014198 -0.0139994 0.2231968 -0.0002577 0.0037987 0.0042045 -0.1319412 0.0520252 -0.0340555 -0.0048896 0.011478 -0.288834 -0.0021305 -0.0038406 -0.0014508 -0.1712606 -0.0029207 -0.1267071 -0.0013059 -0.0595594 -0.0009086 -0.0013916 -0.004243 -0.0013236 0.1426618 0.0842157 -0.0735071 0.0034285 -0.0245026 0.0522841 -0.0018443 -0.0253865 0.005988 0.1310128 0.0168301 0.0847214 -0.002606 0.0293084 -0.087846 -0.000414 -0.0001867 0.0028299 0.1668657 -0.0048831 -0.0623883 -0.0014979 -0.1257525 -0.0305221 -0.0007488 0.0042721 0.0010841 0.1573848 0.0608758 0.0530315 0.0006182 0.0773447 -0.0950312 0.0000584 0.0002655 -0.0004721 0.15309 -0.1255153 0.0492532 -0.0006529 0.0506021 0.0808626 -0.0004425 -0.0008218 -0.0011245 0.1652724 0.256638 -0.0851916 -0.0014284 -0.0784773 0.1704846 0.0026301 0.0109034 0.0030796 0.3636503 0.2946823 0.038481 0.0023171 0.0258459 0.3466638 0.0154795 0.0176806 -0.0217649 0.3402752 0.2536833 -0.0740378 0.0829761 -0.1223049 0.1637433 0.0627304 0.0136618 -0.0149175 0.2585098 unknown
polarizability: 213.8500445|-16.2710478|183.7946765|2.3011535|1.5635353|76.0632335 unknown
InChI: InChI=1S/C10H9NO3S/c11-9-6-5-7-3-1-2-4-8(7)10(9)15(12,13)14/h1-6,12H,11H2
charge 0 multiplicity 1
24 atoms
S  2.03696 1.079815 0.000918
O  1.818451 1.61519 1.778577
O  3.530943 0.435297 -0.146647
O  1.718671 2.376483 -0.914704
N  2.477211 -2.033301 0.036503
C  -0.649045 0.151223 -0.017837
C  0.739554 -0.252043 -0.021637
C  -1.643802 -0.90436 -0.018345
C  1.169529 -1.609258 0.010235
C  -1.210444 -2.273126 -0.01201
C  -1.112576 1.507549 -0.013904
C  0.127218 -2.615567 -0.000695
C  -3.034372 -0.576087 -0.016024
C  -2.482548 1.79475 -0.009182
C  -3.457861 0.755176 -0.011014
H  -1.971392 -3.062186 -0.015889
H  -0.396674 2.332061 -0.029194
H  0.436206 -3.667091 0.007473
H  -3.764886 -1.393704 -0.016668
H  -2.808405 2.840625 -0.005731
H  -4.524448 1.001594 -0.008425
H  2.67865 -3.029908 0.0461
H  3.240755 -1.341356 0.013045
H  2.356704 2.452924 1.893555
