program: Orca
programVersion: 5.0.2
elementType: O O O N N C C C C C C C C C C C C C C C C C H H H H H H H H H H H H H H H H H H H H
charge: 0
multiplicity: 1
keywords: wb97x-d3
keywords: def2-TZVPP
keywords: def2/J RIJCOSX
keywords: DEFGRID2
keywords: scfconv7
keywords: smallprint printgap noloewdin
keywords: NOSOSCF
formula: C17H20N2O3
InChI: InChI=1/C17H20N2O3/c1-12(2)22-17(20)19-18-15-11-14(9-10-16(15)21-3)13-7-5-4-6-8-13/h4-12,18-19H,1-3H3
42 atoms
O  2.444668 -1.94569 -0.098051
O  2.324206 2.916243 -0.237299
O  1.741831 -2.812576 1.863947
N  2.068595 0.492156 0.782344
N  1.955764 -0.584022 1.602733
C  -1.460042 1.221777 -0.100254
C  0.929845 1.134751 0.323439
C  -0.327919 0.558486 0.380833
C  -2.784758 0.577075 -0.023107
C  1.063343 2.42154 -0.232264
C  -1.30821 2.486904 -0.644473
C  -0.052871 3.082634 -0.707922
C  2.519564 -3.24414 -0.707138
C  -3.917836 1.31144 0.325824
C  -2.937156 -0.782954 -0.292231
C  1.151294 -3.663324 -1.213485
C  3.539506 -3.126469 -1.821026
C  -5.162299 0.706984 0.403585
C  -4.18018 -1.389666 -0.210688
C  -5.299016 -0.647257 0.137288
C  2.021679 -1.878609 1.155685
C  2.532779 4.208461 -0.743397
H  -0.446055 -0.417345 0.833444
H  -2.162161 3.012297 -1.050642
H  0.034337 4.068515 -1.144142
H  2.868131 -3.96705 0.034668
H  2.889093 1.055153 0.927266
H  -3.818748 2.362681 0.565596
H  -2.075987 -1.368195 -0.590138
H  0.438612 -3.768123 -0.396555
H  0.76197 -2.938243 -1.929855
H  1.219734 -4.628646 -1.715875
H  3.661268 -4.090229 -2.315058
H  4.51277 -2.822164 -1.436663
H  3.225206 -2.400458 -2.571567
H  1.524434 -0.465465 2.510266
H  -6.026632 1.294198 0.685213
H  -4.276102 -2.445368 -0.42846
H  -6.269684 -1.120793 0.20166
H  3.595898 4.415568 -0.643602
H  1.974736 4.965626 -0.183305
H  2.260929 4.284694 -1.800724
totalener: -995.11508937 hartree
nucrepener: 1761.32614233 hartree
electener: -2756.44123170 hartree
oneelecener: -4851.65230323 hartree
twoeener: 2095.21107153 hartree
kineticenergy: 990.83851612 hartree
xcener: -96.160274829526 hartree
chargesum: -0.0000000
charge: -0.271885 -0.327265 -0.407217 -0.085648 -0.185843 0.127901 0.035653 -0.186345 0.113052 0.255139 -0.231207 -0.159028 0.144412 -0.191205 -0.198129 -0.266801 -0.229115 -0.134511 -0.130174 -0.119770 0.428744 -0.144450 0.121246 0.117022 0.106619 0.065598 0.146817 0.120289 0.122049 0.101667 0.084530 0.085816 0.075841 0.089619 0.084697 0.160066 0.121411 0.121391 0.123125 0.112704 0.101425 0.101760
qa: -0.2719 -0.3273 -0.4072 -0.0856 -0.1858 0.1279 0.0357 -0.1863 0.1131 0.2551 -0.2312 -0.1590 0.1444 -0.1912 -0.1981 -0.2668 -0.2291 -0.1345 -0.1302 -0.1198 0.4287 -0.1444 0.1212 0.1170 0.1066 0.0656 0.1468 0.1203 0.1220 0.1017 0.0845 0.0858 0.0758 0.0896 0.0847 0.1601 0.1214 0.1214 0.1231 0.1127 0.1014 0.1018
va: 2.1332 2.0498 2.1115 3.0617 3.1603 3.7086 4.1492 3.9475 3.5769 3.9097 4.0639 3.9250 3.8336 3.9914 3.9983 3.9096 3.9345 3.9756 3.9715 3.9581 4.4248 3.9162 1.0304 1.0129 1.0174 1.0241 1.0425 1.0120 1.0082 1.0170 1.0072 1.0117 1.0083 1.0113 1.0085 1.0309 1.0033 1.0033 1.0004 0.9979 0.9867 0.9860
dispcorr: -0.017901745 hartree
energy: -995.132991115148
dipole: 3.75461 -3.26294 0.49167 -4.69324 5.82772 1.13447 -9.74522 9.10132 -0.64391
magnitude: 1.39405 au
magnitude: 3.54340 debye
