program: Orca
programVersion: 5.0.2
elementType: O O O N N C C C C C C C C C C C C C C C C C H H H H H H H H H H H H H H H H H H H H
charge: 0
multiplicity: 1
keywords: wb97x-d3
keywords: def2-TZVPP
keywords: def2/J RIJCOSX
keywords: DEFGRID2
keywords: scfconv7
keywords: smallprint printgap noloewdin
keywords: NOSOSCF
formula: C17H20N2O3
InChI: InChI=1/C17H20N2O3/c1-12(2)22-17(20)19-18-15-11-14(9-10-16(15)21-3)13-7-5-4-6-8-13/h4-12,18-19H,1-3H3
42 atoms
O  2.332694 -1.920137 -0.157777
O  2.373675 2.945618 -0.306877
O  1.786255 -2.751042 1.868447
N  2.17899 0.527431 0.744849
N  2.112204 -0.537615 1.583081
C  -1.378675 1.19418 -0.060086
C  1.021766 1.151047 0.310798
C  -0.225805 0.556605 0.405002
C  -2.687606 0.521803 0.044376
C  1.120807 2.431958 -0.264142
C  -1.260328 2.455349 -0.622095
C  -0.016488 3.070266 -0.720615
C  2.192576 -3.205813 -0.781853
C  -3.832814 1.232437 0.40273
C  -2.811512 -0.843753 -0.212251
C  0.733909 -3.457222 -1.12003
C  3.075764 -3.178595 -2.012334
C  -5.061441 0.599162 0.502005
C  -4.038508 -1.479017 -0.109842
C  -5.169676 -0.760004 0.247415
C  2.05096 -1.833056 1.134296
C  2.5482 4.235912 -0.831376
H  -0.319813 -0.413721 0.875033
H  -2.131805 2.961162 -1.016075
H  0.044531 4.052474 -1.169489
H  2.545459 -3.978619 -0.094853
H  3.012565 1.083151 0.820052
H  -3.754638 2.287798 0.632553
H  -1.940294 -1.410345 -0.517849
H  0.117479 -3.50302 -0.222548
H  0.346501 -2.674294 -1.774507
H  0.629172 -4.410992 -1.638069
H  3.027646 -4.140315 -2.523076
H  4.116911 -2.99157 -1.749985
H  2.755939 -2.40822 -2.715157
H  1.752243 -0.39704 2.518145
H  -5.936052 1.167684 0.790346
H  -4.112385 -2.538411 -0.318343
H  -6.128117 -1.255594 0.327686
H  2.249242 4.296212 -1.882244
H  3.609789 4.462097 -0.760097
H  1.991482 4.989234 -0.265199
totalener: -995.11478608 hartree
nucrepener: 1775.15693629 hartree
electener: -2770.27172238 hartree
oneelecener: -4879.28747284 hartree
twoeener: 2109.01575047 hartree
kineticenergy: 990.83786346 hartree
xcener: -96.160574822577 hartree
chargesum: -0.0000000
charge: -0.271416 -0.328673 -0.402135 -0.078532 -0.181891 0.126536 0.032393 -0.191008 0.114381 0.254295 -0.230455 -0.159865 0.152681 -0.187738 -0.184993 -0.280660 -0.231689 -0.135451 -0.136778 -0.117552 0.413540 -0.144615 0.124721 0.116613 0.106507 0.067903 0.146068 0.120448 0.113643 0.101907 0.086506 0.091986 0.075842 0.090376 0.085484 0.160590 0.121602 0.120413 0.122997 0.101733 0.112723 0.101564
qa: -0.2714 -0.3287 -0.4021 -0.0785 -0.1819 0.1265 0.0324 -0.1910 0.1144 0.2543 -0.2305 -0.1599 0.1527 -0.1877 -0.1850 -0.2807 -0.2317 -0.1355 -0.1368 -0.1176 0.4135 -0.1446 0.1247 0.1166 0.1065 0.0679 0.1461 0.1204 0.1136 0.1019 0.0865 0.0920 0.0758 0.0904 0.0855 0.1606 0.1216 0.1204 0.1230 0.1017 0.1127 0.1016
va: 2.1328 2.0480 2.1158 3.0646 3.1563 3.6984 4.1657 3.9406 3.5700 3.9103 4.0661 3.9264 3.8183 3.9870 3.9955 3.9107 3.9351 3.9765 3.9786 3.9554 4.4391 3.9162 1.0279 1.0129 1.0175 1.0241 1.0444 1.0120 1.0098 1.0155 1.0046 1.0128 1.0081 1.0110 1.0082 1.0304 1.0032 1.0036 1.0003 0.9860 0.9979 0.9868
dispcorr: -0.018619274 hartree
energy: -995.133405355891
dipole: 1.82593 -1.40836 0.41757 -4.53185 5.65373 1.12189 -9.98965 9.29111 -0.69854
magnitude: 1.38599 au
magnitude: 3.52290 debye
