program: Orca
programVersion: 5.0.2
elementType: O O O N N C C C C C C C C C C C C C C C C C H H H H H H H H H H H H H H H H H H H H
charge: 0
multiplicity: 1
keywords: wb97x-d3
keywords: def2-TZVPP
keywords: def2/J RIJCOSX
keywords: DEFGRID2
keywords: scfconv7
keywords: smallprint printgap noloewdin
keywords: NOSOSCF
formula: C17H20N2O3
InChI: InChI=1/C17H20N2O3/c1-12(2)22-17(20)19-18-15-11-14(9-10-16(15)21-3)13-7-5-4-6-8-13/h4-12,18-19H,1-3H3
42 atoms
O  2.296897 -1.512024 0.17276
O  2.527531 2.586026 -0.180862
O  1.636978 -3.072519 -1.323479
N  1.991348 0.411574 -1.59095
N  1.907646 -0.908627 -1.927971
C  -1.313121 1.026787 -0.008172
C  0.977568 0.965365 -0.810864
C  -0.299607 0.434648 -0.765001
C  -2.661813 0.429771 0.0270
C  1.2545 2.134967 -0.082845
C  -1.020051 2.178269 0.706216
C  0.255939 2.728793 0.667441
C  2.190091 -2.419156 1.280901
C  -2.832754 -0.952508 0.100942
C  -3.800653 1.233993 -0.012303
C  3.129982 -1.891889 2.345968
C  0.750636 -2.483077 1.757954
C  -4.099833 -1.51251 0.134199
C  -5.068326 0.675682 0.024682
C  -5.223936 -0.700711 0.097331
C  1.916818 -1.939722 -1.026108
C  2.886908 3.736529 0.53751
H  -0.52852 -0.446345 -1.350935
H  -1.775769 2.641914 1.326217
H  0.45628 3.620137 1.246381
H  2.516039 -3.412181 0.961487
H  2.92357 0.707791 -1.350183
H  -1.963304 -1.59626 0.154914
H  -3.691531 2.30785 -0.098878
H  2.833298 -0.895823 2.677323
H  3.114896 -2.552066 3.212925
H  4.156251 -1.842313 1.982336
H  0.383975 -1.491553 2.027507
H  0.67638 -3.123371 2.637509
H  0.095871 -2.900549 0.993782
H  1.592218 -1.126603 -2.85882
H  -4.208659 -2.587472 0.196232
H  -5.93821 1.318355 -0.014337
H  -6.213429 -1.137566 0.123156
H  2.76739 3.602648 1.617208
H  2.308538 4.612152 0.227057
H  3.937397 3.922156 0.325151
totalener: -995.11622959 hartree
nucrepener: 1811.16232826 hartree
electener: -2806.27855785 hartree
oneelecener: -4951.26338025 hartree
twoeener: 2144.98482240 hartree
kineticenergy: 990.84104377 hartree
xcener: -96.160233384714 hartree
chargesum: 0.0000000
charge: -0.291780 -0.324448 -0.394719 -0.100423 -0.155258 0.137082 0.052806 -0.221540 0.142083 0.260799 -0.225694 -0.168054 0.150111 -0.196937 -0.195381 -0.234862 -0.281371 -0.138184 -0.131627 -0.119881 0.404981 -0.143252 0.119563 0.117874 0.107070 0.071939 0.137570 0.108173 0.120859 0.084141 0.078152 0.090403 0.092741 0.093564 0.103513 0.168236 0.122507 0.121378 0.123280 0.099935 0.101982 0.112668
qa: -0.2918 -0.3244 -0.3947 -0.1004 -0.1553 0.1371 0.0528 -0.2215 0.1421 0.2608 -0.2257 -0.1681 0.1501 -0.1969 -0.1954 -0.2349 -0.2814 -0.1382 -0.1316 -0.1199 0.4050 -0.1433 0.1196 0.1179 0.1071 0.0719 0.1376 0.1082 0.1209 0.0841 0.0782 0.0904 0.0927 0.0936 0.1035 0.1682 0.1225 0.1214 0.1233 0.0999 0.1020 0.1127
va: 2.1065 2.0552 2.1239 3.1083 3.1786 3.6258 4.0722 3.9437 3.5243 3.8865 4.0615 3.9279 3.8196 3.9902 3.9931 3.9358 3.9070 3.9957 3.9714 3.9569 4.4276 3.9159 1.0290 1.0121 1.0177 1.0222 1.0497 1.0155 1.0125 1.0070 1.0091 1.0107 1.0048 1.0142 1.0163 1.0213 1.0028 1.0031 1.0003 0.9865 0.9862 0.9981
dispcorr: -0.020141486 hartree
energy: -995.136371076038
dipole: 2.98190 -2.44190 0.54000 -0.66766 1.75851 1.09085 12.92196 -12.09317 0.82879
magnitude: 1.47256 au
magnitude: 3.74295 debye
