program: Orca
programVersion: 5.0.2
elementType: O O O N N C C C C C C C C C C C C C C C C C H H H H H H H H H H H H H H H H H H H H
charge: 0
multiplicity: 1
keywords: wb97x-d3
keywords: def2-TZVPP
keywords: def2/J RIJCOSX
keywords: DEFGRID2
keywords: scfconv7
keywords: smallprint printgap noloewdin
keywords: NOSOSCF
formula: C17H20N2O3
InChI: InChI=1/C17H20N2O3/c1-12(2)22-17(20)19-18-15-11-14(9-10-16(15)21-3)13-7-5-4-6-8-13/h4-12,18-19H,1-3H3
42 atoms
O  2.166394 -1.438869 0.218685
O  2.471549 2.574538 -0.14873
O  1.633566 -3.056304 -1.270828
N  1.984495 0.421844 -1.616163
N  1.93759 -0.909865 -1.921789
C  -1.353608 0.969071 -0.080219
C  0.948212 0.958911 -0.852529
C  -0.325227 0.418094 -0.847198
C  -2.690804 0.346056 -0.071215
C  1.202374 2.107099 -0.084271
C  -1.08127 2.097291 0.679077
C  0.187624 2.664532 0.672751
C  1.934406 -2.265021 1.370003
C  -3.846091 1.12722 -0.049908
C  -2.8338 -1.041705 -0.076687
C  3.272651 -2.606233 1.99498
C  1.027459 -1.483257 2.300769
C  -5.101757 0.541821 -0.029161
C  -4.088934 -1.628502 -0.060797
C  -5.229256 -0.83935 -0.03491
C  1.886387 -1.913286 -0.989592
C  2.818325 3.683972 0.637439
H  -0.535214 -0.444615 -1.466434
H  -1.847204 2.528147 1.310007
H  0.371085 3.537207 1.284788
H  1.438329 -3.184988 1.054529
H  2.9045 0.736404 -1.351218
H  -3.760164 2.2063 -0.075163
H  -1.952391 -1.671617 -0.073616
H  3.900437 -3.167862 1.303482
H  3.809189 -1.705665 2.296976
H  3.12405 -3.221085 2.883038
H  0.812699 -2.068939 3.195075
H  0.079181 -1.239928 1.82083
H  1.492376 -0.547045 2.612398
H  1.683849 -1.155393 -2.864378
H  -5.984619 1.167624 -0.019016
H  -4.175216 -2.707233 -0.060776
H  -6.209356 -1.297333 -0.021161
H  3.870493 3.884457 0.448048
H  2.686503 3.488422 1.706296
H  2.240913 4.574295 0.370239
totalener: -995.11487235 hartree
nucrepener: 1816.55856978 hartree
electener: -2811.67344213 hartree
oneelecener: -4962.04526341 hartree
twoeener: 2150.37182127 hartree
kineticenergy: 990.84597969 hartree
xcener: -96.161017551141 hartree
chargesum: -0.0000000
charge: -0.290480 -0.324778 -0.395417 -0.104158 -0.157736 0.114399 0.054599 -0.213859 0.153946 0.266814 -0.210127 -0.174569 0.125328 -0.196018 -0.209173 -0.241377 -0.220725 -0.131070 -0.141881 -0.120187 0.411740 -0.142486 0.117093 0.117284 0.107011 0.073144 0.137481 0.120689 0.116172 0.094878 0.079880 0.079236 0.089502 0.082682 0.079783 0.168494 0.121322 0.124399 0.123711 0.112955 0.100167 0.101334
qa: -0.2905 -0.3248 -0.3954 -0.1042 -0.1577 0.1144 0.0546 -0.2139 0.1539 0.2668 -0.2101 -0.1746 0.1253 -0.1960 -0.2092 -0.2414 -0.2207 -0.1311 -0.1419 -0.1202 0.4117 -0.1425 0.1171 0.1173 0.1070 0.0731 0.1375 0.1207 0.1162 0.0949 0.0799 0.0792 0.0895 0.0827 0.0798 0.1685 0.1213 0.1244 0.1237 0.1130 0.1002 0.1013
va: 2.0976 2.0548 2.1237 3.1030 3.1737 3.6484 4.0455 3.9436 3.5225 3.8683 4.0536 3.9384 3.8392 4.0006 3.9897 3.9366 3.9211 3.9722 4.0072 3.9597 4.4283 3.9155 1.0311 1.0118 1.0176 1.0324 1.0505 1.0129 1.0145 1.0110 1.0086 1.0088 1.0123 1.0131 1.0097 1.0213 1.0033 1.0029 1.0002 0.9980 0.9870 0.9859
dispcorr: -0.020438353 hartree
energy: -995.135310701340
dipole: 3.83028 -3.36041 0.46987 -0.29080 1.41316 1.12236 13.46115 -12.60095 0.86020
magnitude: 1.49010 au
magnitude: 3.78754 debye
