program: Orca
programVersion: 5.0.2
elementType: O O O N N C C C C C C C C C C C C C C C C C H H H H H H H H H H H H H H H H H H H H
charge: 0
multiplicity: 1
keywords: wb97x-d3
keywords: def2-TZVPP
keywords: def2/J RIJCOSX
keywords: DEFGRID2
keywords: scfconv7
keywords: smallprint printgap noloewdin
keywords: NOSOSCF
formula: C17H20N2O3
InChI: InChI=1/C17H20N2O3/c1-12(2)22-17(20)19-18-15-11-14(9-10-16(15)21-3)13-7-5-4-6-8-13/h4-12,18-19H,1-3H3
42 atoms
O  2.154367 -2.534525 0.816432
O  2.29057 3.135175 -0.667486
O  2.366924 -1.143086 -0.955817
N  2.22049 0.954224 0.831191
N  2.296789 -0.362136 1.177566
C  -1.361104 1.251131 -0.116801
C  1.031516 1.408387 0.256402
C  -0.1802 0.770922 0.452556
C  -2.631685 0.53334 0.09879
C  1.06629 2.575897 -0.524202
C  -1.306906 2.400436 -0.889047
C  -0.099587 3.059833 -1.089328
C  1.984027 -3.682087 -0.03297
C  -2.9816 0.057615 1.362073
C  -3.511217 0.306937 -0.959319
C  2.398019 -4.885381 0.789359
C  0.543596 -3.76778 -0.504842
C  -4.17047 -0.625836 1.561148
C  -4.700886 -0.375436 -0.761803
C  -5.035262 -0.846339 0.49928
C  2.274898 -1.343867 0.224973
C  2.430539 4.222396 -1.543611
H  -0.212453 -0.144342 1.029631
H  -2.210691 2.807958 -1.322348
H  -0.089225 3.957606 -1.692258
H  2.645221 -3.583549 -0.897302
H  3.058219 1.2974 0.387763
H  -2.324796 0.246502 2.202211
H  -3.245681 0.646107 -1.952761
H  3.432078 -4.804653 1.123639
H  1.761021 -5.005696 1.666652
H  2.311565 -5.790347 0.188227
H  0.261461 -2.898748 -1.097281
H  -0.140911 -3.849785 0.340964
H  0.408352 -4.650669 -1.130413
H  2.173664 -0.591069 2.149565
H  -4.42674 -0.979664 2.551379
H  -5.364879 -0.548812 -1.598699
H  -5.96314 -1.381211 0.65335
H  3.486767 4.482156 -1.552427
H  1.861319 5.095906 -1.21085
H  2.122782 3.969825 -2.563009
totalener: -995.11686838 hartree
nucrepener: 1768.67062267 hartree
electener: -2763.78749105 hartree
oneelecener: -4866.66451184 hartree
twoeener: 2102.87702079 hartree
kineticenergy: 990.84134643 hartree
xcener: -96.158375248158 hartree
chargesum: 0.0000000
charge: -0.310356 -0.324477 -0.389350 -0.114820 -0.148363 0.157226 0.045232 -0.178956 0.102665 0.250106 -0.230389 -0.159743 0.144790 -0.197302 -0.187681 -0.232990 -0.253676 -0.134497 -0.137973 -0.118599 0.414380 -0.143094 0.101990 0.116474 0.106167 0.066586 0.145266 0.122420 0.123462 0.092061 0.081444 0.078530 0.107639 0.081195 0.081961 0.162090 0.120907 0.121870 0.122925 0.112035 0.098294 0.104550
qa: -0.3104 -0.3245 -0.3894 -0.1148 -0.1484 0.1572 0.0452 -0.1790 0.1027 0.2501 -0.2304 -0.1597 0.1448 -0.1973 -0.1877 -0.2330 -0.2537 -0.1345 -0.1380 -0.1186 0.4144 -0.1431 0.1020 0.1165 0.1062 0.0666 0.1453 0.1224 0.1235 0.0921 0.0814 0.0785 0.1076 0.0812 0.0820 0.1621 0.1209 0.1219 0.1229 0.1120 0.0983 0.1046
va: 2.0850 2.0589 2.1279 3.1255 3.1772 3.6519 4.1099 3.9627 3.5817 3.9132 4.0608 3.9307 3.8573 3.9808 3.9845 3.9315 3.8976 3.9676 3.9759 3.9540 4.4221 3.9166 1.0376 1.0127 1.0169 1.0217 1.0434 1.0101 1.0108 1.0102 1.0092 1.0085 1.0189 1.0094 1.0107 1.0266 1.0032 1.0032 1.0004 0.9982 0.9842 0.9880
dispcorr: -0.018066143 hartree
energy: -995.134934525553
dipole: -0.34233 0.54536 0.20303 -11.03815 10.97287 -0.06528 -2.45247 2.65991 0.20743
magnitude: 0.29751 au
magnitude: 0.75621 debye
