program: Orca
programVersion: 5.0.2
elementType: O O O N N C C C C C C C C C C C C C C C C C H H H H H H H H H H H H H H H H H H H H
charge: 0
multiplicity: 1
keywords: wb97x-d3
keywords: def2-TZVPP
keywords: def2/J RIJCOSX
keywords: DEFGRID2
keywords: scfconv7
keywords: smallprint printgap noloewdin
keywords: NOSOSCF
formula: C17H20N2O3
InChI: InChI=1/C17H20N2O3/c1-12(2)22-17(20)19-18-15-11-14(9-10-16(15)21-3)13-7-5-4-6-8-13/h4-12,18-19H,1-3H3
42 atoms
O  2.04737 -2.77294 0.08215
O  2.237389 3.07195 -0.69396
O  2.333069 -0.836402 1.218965
N  2.012745 0.48376 -1.18472
N  2.020696 -0.869771 -1.030608
C  -1.49133 1.309237 -0.258392
C  0.878247 1.182591 -0.765661
C  -0.358413 0.580556 -0.627192
C  -2.790022 0.628665 -0.096712
C  0.99226 2.564343 -0.537871
C  -1.360309 2.67098 -0.036327
C  -0.125266 3.294139 -0.174997
C  2.156515 -3.562643 1.278212
C  -3.971519 1.217382 -0.546706
C  -2.868385 -0.622648 0.514767
C  1.416393 -4.855498 0.999892
C  3.614296 -3.791298 1.631323
C  -5.190523 0.577327 -0.390019
C  -4.085831 -1.265717 0.668627
C  -5.253485 -0.668393 0.216799
C  2.150596 -1.446744 0.200309
C  2.450195 4.426804 -0.398039
H  -0.455368 -0.478206 -0.828363
H  -2.213146 3.255504 0.282133
H  -0.05176 4.355266 0.020728
H  1.666842 -3.030055 2.097339
H  2.887056 0.920007 -0.935084
H  -3.931277 2.176755 -1.04709
H  -1.967088 -1.0844 0.898564
H  1.43942 -5.492711 1.883772
H  0.372104 -4.670453 0.749241
H  1.873648 -5.407862 0.178035
H  3.687069 -4.419522 2.519731
H  4.124032 -2.854117 1.849602
H  4.140279 -4.297067 0.82017
H  1.898897 -1.432094 -1.855864
H  -6.094412 1.050056 -0.751889
H  -4.123916 -2.233333 1.152015
H  -6.204985 -1.169321 0.337181
H  1.874217 5.087168 -1.053692
H  3.508713 4.619178 -0.558029
H  2.204723 4.664002 0.641683
totalener: -995.11736645 hartree
nucrepener: 1749.35739995 hartree
electener: -2744.47476640 hartree
oneelecener: -4827.98933792 hartree
twoeener: 2083.51457152 hartree
kineticenergy: 990.83835211 hartree
xcener: -96.158678533786 hartree
chargesum: 0.0000000
charge: -0.314004 -0.323952 -0.396917 -0.120684 -0.153976 0.135845 0.052988 -0.154394 0.096251 0.243848 -0.223356 -0.165078 0.142182 -0.188173 -0.195236 -0.229485 -0.253642 -0.135789 -0.130798 -0.119749 0.432256 -0.143700 0.105573 0.116331 0.105247 0.065095 0.144928 0.121331 0.123869 0.078813 0.090513 0.082208 0.082014 0.105099 0.080262 0.167623 0.120469 0.119646 0.122665 0.098247 0.111575 0.104055
qa: -0.3140 -0.3240 -0.3969 -0.1207 -0.1540 0.1358 0.0530 -0.1544 0.0963 0.2438 -0.2234 -0.1651 0.1422 -0.1882 -0.1952 -0.2295 -0.2536 -0.1358 -0.1308 -0.1197 0.4323 -0.1437 0.1056 0.1163 0.1052 0.0651 0.1449 0.1213 0.1239 0.0788 0.0905 0.0822 0.0820 0.1051 0.0803 0.1676 0.1205 0.1196 0.1227 0.0982 0.1116 0.1041
va: 2.0841 2.0588 2.1208 3.1187 3.1800 3.6923 4.0971 3.9643 3.6138 3.9225 4.0615 3.9362 3.8645 3.9880 3.9841 3.9311 3.9044 3.9753 3.9635 3.9579 4.3945 3.9174 1.0374 1.0125 1.0178 1.0222 1.0432 1.0116 1.0102 1.0084 1.0107 1.0091 1.0098 1.0176 1.0092 1.0238 1.0034 1.0037 1.0004 0.9852 0.9983 0.9868
dispcorr: -0.017505519 hartree
energy: -995.134871971552
dipole: 4.41495 -4.01590 0.39905 -9.95390 9.77612 -0.17778 5.66985 -5.94813 -0.27828
magnitude: 0.51796 au
magnitude: 1.31656 debye
