program: Orca
programVersion: 5.0.2
elementType: O O O N N C C C C C C C C C C C C C C C C C H H H H H H H H H H H H H H H H H H H H
charge: 0
multiplicity: 1
keywords: wb97x-d3
keywords: def2-TZVPP
keywords: def2/J RIJCOSX
keywords: DEFGRID2
keywords: scfconv7
keywords: smallprint printgap noloewdin
keywords: NOSOSCF
formula: C17H20N2O3
InChI: InChI=1/C17H20N2O3/c1-12(2)22-17(20)19-18-15-11-14(9-10-16(15)21-3)13-7-5-4-6-8-13/h4-12,18-19H,1-3H3
42 atoms
O  2.091773 -1.511064 -0.263768
O  2.434299 2.650892 -0.014037
O  1.600261 -3.002298 1.361511
N  1.989031 0.490595 1.442122
N  1.917434 -0.813347 1.837445
C  -1.40156 1.074342 0.039738
C  0.928699 1.03185 0.718205
C  -0.346573 0.496269 0.749211
C  -2.744091 0.464136 0.075666
C  1.159658 2.193797 -0.037925
C  -1.153511 2.218217 -0.703519
C  0.119837 2.775045 -0.739919
C  1.930024 -2.486055 -1.307064
C  -3.889299 1.256586 0.150365
C  -2.90229 -0.920989 0.02998
C  1.555441 -1.707709 -2.552067
C  3.205679 -3.289275 -1.474335
C  -5.151081 0.684414 0.172792
C  -4.163295 -1.494749 0.056325
C  -5.294056 -0.694458 0.125862
C  1.845211 -1.884026 0.986214
C  2.750789 3.793406 -0.765072
H  -0.539575 -0.377741 1.357935
H  -1.943557 2.66975 -1.28866
H  0.284566 3.660641 -1.338578
H  1.112793 -3.159198 -1.035808
H  2.905034 0.76924 1.128896
H  -3.788363 2.332654 0.216729
H  -2.02886 -1.556738 -0.048905
H  2.354788 -1.028121 -2.850586
H  1.373111 -2.394186 -3.37875
H  0.650997 -1.12035 -2.393341
H  3.444372 -3.84833 -0.57082
H  4.047812 -2.640037 -1.718921
H  3.089936 -4.006919 -2.28718
H  1.688785 -0.989886 2.80195
H  -6.025816 1.318297 0.237707
H  -4.26239 -2.571589 0.014255
H  -6.27879 -1.142214 0.144958
H  2.186611 4.671137 -0.435183
H  2.574813 3.645316 -1.835086
H  3.810376 3.984954 -0.610712
totalener: -995.11634331 hartree
nucrepener: 1799.14365935 hartree
electener: -2794.26000266 hartree
oneelecener: -4927.25733578 hartree
twoeener: 2132.99733311 hartree
kineticenergy: 990.84027450 hartree
xcener: -96.159895758192 hartree
chargesum: -0.0000000
charge: -0.288535 -0.324452 -0.400247 -0.098601 -0.158244 0.132915 0.034748 -0.188874 0.125174 0.259238 -0.226428 -0.166524 0.131319 -0.195100 -0.202756 -0.224934 -0.252137 -0.132956 -0.133013 -0.119771 0.414387 -0.143289 0.119452 0.117436 0.106517 0.061765 0.137708 0.120777 0.119644 0.079097 0.083247 0.094531 0.104992 0.079468 0.081208 0.169699 0.121370 0.123347 0.123351 0.101799 0.100117 0.112554
qa: -0.2885 -0.3245 -0.4002 -0.0986 -0.1582 0.1329 0.0347 -0.1889 0.1252 0.2592 -0.2264 -0.1665 0.1313 -0.1951 -0.2028 -0.2249 -0.2521 -0.1330 -0.1330 -0.1198 0.4144 -0.1433 0.1195 0.1174 0.1065 0.0618 0.1377 0.1208 0.1196 0.0791 0.0832 0.0945 0.1050 0.0795 0.0812 0.1697 0.1214 0.1233 0.1234 0.1018 0.1001 0.1126
va: 2.1108 2.0553 2.1186 3.1017 3.1819 3.6600 4.0993 3.9530 3.5634 3.8893 4.0603 3.9308 3.8588 3.9941 3.9893 3.9216 3.9143 3.9731 3.9793 3.9574 4.4181 3.9163 1.0302 1.0124 1.0178 1.0241 1.0492 1.0124 1.0122 1.0096 1.0104 1.0092 1.0169 1.0089 1.0101 1.0204 1.0032 1.0029 1.0003 0.9862 0.9866 0.9981
dispcorr: -0.019337369 hartree
energy: -995.135680683592
dipole: 4.81464 -4.28593 0.52871 -2.08159 3.11838 1.03679 -12.71647 11.84518 -0.87129
magnitude: 1.45382 au
magnitude: 3.69533 debye
