program: Orca
programVersion: 5.0.2
elementType: O O O N N C C C C C C C C C C C C C C C C C H H H H H H H H H H H H H H H H H H H H
charge: 0
multiplicity: 1
keywords: wb97x-d3
keywords: def2-TZVPP
keywords: def2/J RIJCOSX
keywords: DEFGRID2
keywords: scfconv7
keywords: smallprint printgap noloewdin
keywords: NOSOSCF
formula: C17H20N2O3
InChI: InChI=1/C17H20N2O3/c1-12(2)22-17(20)19-18-15-11-14(9-10-16(15)21-3)13-7-5-4-6-8-13/h4-12,18-19H,1-3H3
42 atoms
O  2.271521 -2.515909 1.06847
O  2.234806 3.066615 -0.866151
O  2.421364 -1.30151 -0.836013
N  2.107546 0.957095 0.719512
N  2.144081 -0.318741 1.193371
C  -1.458816 1.278009 -0.275291
C  0.935107 1.393128 0.100315
C  -0.2888 0.783611 0.305282
C  -2.745904 0.593015 -0.053035
C  0.997943 2.538842 -0.710944
C  -1.378874 2.411734 -1.068498
C  -0.156561 3.036918 -1.286212
C  2.370855 -3.759424 0.356505
C  -2.828567 -0.799029 -0.075969
C  -3.913486 1.319593 0.178353
C  2.848909 -4.784229 1.364994
C  1.032006 -4.130324 -0.255549
C  -4.038253 -1.443715 0.126341
C  -5.124547 0.676398 0.377235
C  -5.192445 -0.708708 0.353054
C  2.289459 -1.387186 0.355381
C  2.389515 4.163086 -1.727425
H  -0.344516 -0.084693 0.948589
H  -2.263831 2.800253 -1.554871
H  -0.124017 3.910073 -1.923508
H  3.113643 -3.653412 -0.438496
H  2.957481 1.240524 0.256506
H  -1.939056 -1.38175 -0.281583
H  -3.866636 2.400309 0.226488
H  2.976278 -5.750685 0.877929
H  3.807211 -4.500343 1.799381
H  2.128938 -4.910697 2.174764
H  1.112978 -5.088798 -0.76908
H  0.708045 -3.392124 -0.987521
H  0.263085 -4.226839 0.512737
H  2.103324 -0.445599 2.190634
H  -4.081328 -2.524665 0.095573
H  -6.017185 1.259964 0.561552
H  -6.137791 -1.211359 0.509329
H  3.44968 4.406571 -1.736469
H  1.834341 5.040461 -1.380959
H  2.075532 3.930708 -2.749828
totalener: -995.11745578 hartree
nucrepener: 1754.10423330 hartree
electener: -2749.22168908 hartree
oneelecener: -4837.47464252 hartree
twoeener: 2088.25295343 hartree
kineticenergy: 990.84240768 hartree
xcener: -96.159519583351 hartree
chargesum: -0.0000000
charge: -0.312111 -0.323766 -0.396693 -0.121443 -0.154970 0.133609 0.055166 -0.160923 0.105231 0.245007 -0.223029 -0.166867 0.145868 -0.199348 -0.193364 -0.233114 -0.261850 -0.130327 -0.132260 -0.122153 0.433003 -0.144538 0.106667 0.116289 0.106362 0.065964 0.144884 0.126502 0.121189 0.078854 0.091787 0.082389 0.085428 0.106309 0.080517 0.168463 0.119622 0.120996 0.122373 0.111906 0.099172 0.103196
qa: -0.3121 -0.3238 -0.3967 -0.1214 -0.1550 0.1336 0.0552 -0.1609 0.1052 0.2450 -0.2230 -0.1669 0.1459 -0.1993 -0.1934 -0.2331 -0.2619 -0.1303 -0.1323 -0.1222 0.4330 -0.1445 0.1067 0.1163 0.1064 0.0660 0.1449 0.1265 0.1212 0.0789 0.0918 0.0824 0.0854 0.1063 0.0805 0.1685 0.1196 0.1210 0.1224 0.1119 0.0992 0.1032
va: 2.0865 2.0588 2.1215 3.1211 3.1802 3.6871 4.0961 3.9657 3.5926 3.9229 4.0603 3.9347 3.8586 3.9908 3.9899 3.9327 3.8967 3.9654 3.9718 3.9600 4.3934 3.9178 1.0380 1.0126 1.0175 1.0206 1.0434 1.0056 1.0120 1.0085 1.0105 1.0088 1.0109 1.0193 1.0085 1.0233 1.0036 1.0031 1.0004 0.9983 0.9851 0.9870
dispcorr: -0.017772326 hartree
energy: -995.135228109791
dipole: 1.72006 -1.31328 0.40678 -11.36408 11.34382 -0.02026 -1.04610 1.37414 0.32804
magnitude: 0.52296 au
magnitude: 1.32926 debye
