program: Orca
programVersion: 5.0.2
elementType: O O O O C C C C C C C C C C C C C C C C C C C C C C C C H H H H H H H H H H H H H H H H H H H H H H H H H H H H H H H H
charge: 0
multiplicity: 1
keywords: wb97x-d3
keywords: def2-TZVPP
keywords: def2/J RIJCOSX
keywords: DEFGRID2
keywords: scfconv7
keywords: smallprint printgap noloewdin
keywords: NOSOSCF
formula: C24H32O4
InChI: InChI=1/C24H32O4/c1-3-4-5-6-7-8-9-10-11-12-17-21-22(26)19-15-13-14-16-20(19)23(27)24(21)28-18(2)25/h13-16H,3-12,17H2,1-2H3
60 atoms
O  2.432337 -1.764168 -1.913656
O  2.32854 2.62924 -0.310759
O  -0.031877 -1.35365 -2.846514
O  1.086056 -3.00614 -0.625369
C  1.027151 0.126657 2.8767
C  -0.017915 -0.714868 2.153573
C  2.338593 -0.615098 3.139708
C  -1.342395 0.004063 1.931555
C  3.131328 -0.954273 1.878035
C  -2.351783 -0.865203 1.189221
C  3.78149 0.269751 1.22454
C  -3.680073 -0.179796 0.885201
C  3.786214 0.237188 -0.311003
C  -4.514539 0.159295 2.114607
C  2.41167 0.35812 -0.890487
C  -5.849642 0.80186 1.760521
C  1.786619 -0.609081 -1.576339
C  1.7201 1.667751 -0.736467
C  0.294589 1.78194 -1.118167
C  -0.336897 0.741069 -1.800709
C  -6.690529 1.138543 2.982458
C  0.419241 -0.476868 -2.138888
C  -0.413674 2.937004 -0.812252
C  -1.668941 0.859165 -2.176299
C  -1.746715 3.046187 -1.178282
C  -2.372282 2.011472 -1.860391
C  1.947341 -2.947701 -1.459471
C  2.615122 -4.095601 -2.130076
H  0.613951 0.460036 3.833867
H  1.219786 1.040456 2.303266
H  -0.196907 -1.632139 2.725884
H  0.36828 -1.03657 1.182453
H  2.11622 -1.537076 3.68574
H  2.967158 -0.015923 3.806231
H  -1.75072 0.320539 2.896362
H  -1.168064 0.921457 1.357438
H  3.905715 -1.685488 2.122227
H  2.47314 -1.46064 1.168579
H  -1.8994 -1.194708 0.247332
H  -2.539833 -1.777387 1.766713
H  4.818367 0.354839 1.555813
H  3.292566 1.183658 1.564344
H  -4.269344 -0.827085 0.227406
H  -3.491795 0.735744 0.314547
H  4.262426 -0.680502 -0.654698
H  4.395467 1.062722 -0.685905
H  -4.693337 -0.752401 2.69557
H  -3.958846 0.834623 2.772674
H  -6.411606 0.131225 1.103194
H  -5.668488 1.711969 1.180458
H  -6.921404 0.243969 3.563986
H  -6.169386 1.833782 3.643366
H  -7.638102 1.601054 2.70279
H  0.064417 3.750013 -0.2834
H  -2.16283 0.056537 -2.706606
H  -2.299389 3.942153 -0.930154
H  -3.411862 2.101027 -2.144403
H  3.6861 -3.931557 -2.236104
H  2.198909 -4.209631 -3.133346
H  2.435604 -5.012274 -1.575782
elementType: O C H
totalener: -1234.88116525 hartree
nucrepener: 2787.00664905 hartree
electener: -4021.88781430 hartree
oneelecener: -7220.38654979 hartree
twoeener: 3198.49873550 hartree
cpcmener: -0.03281198 hartree
kineticenergy: 1229.28385098 hartree
xcener: -121.324725570897 hartree
chargesum: 0.0000000
charge: -0.288573 -0.429176 -0.422723 -0.442665 -0.126452 -0.081086 -0.167122 -0.134701 -0.094163 -0.129727 -0.183523 -0.138179 -0.127626 -0.105003 0.001155 -0.086183 0.189764 0.341542 -0.082375 -0.057426 -0.281663 0.396175 -0.096406 -0.103897 -0.103211 -0.150297 0.448018 -0.237523 0.080764 0.059104 0.075149 -0.008520 0.072117 0.079053 0.084229 0.045015 0.090137 0.029593 0.069032 0.077663 0.092763 0.087147 0.077791 0.046913 0.098080 0.106015 0.058205 0.058984 0.053989 0.055781 0.078031 0.077728 0.090298 0.138400 0.139776 0.166058 0.169461 0.117520 0.122955 0.103812
qa: -0.2886 -0.4292 -0.4227 -0.4427 -0.1265 -0.0811 -0.1671 -0.1347 -0.0942 -0.1297 -0.1835 -0.1382 -0.1276 -0.1050 0.0012 -0.0862 0.1898 0.3415 -0.0824 -0.0574 -0.2817 0.3962 -0.0964 -0.1039 -0.1032 -0.1503 0.4480 -0.2375 0.0808 0.0591 0.0751 -0.0085 0.0721 0.0791 0.0842 0.0450 0.0901 0.0296 0.0690 0.0777 0.0928 0.0871 0.0778 0.0469 0.0981 0.1060 0.0582 0.0590 0.0540 0.0558 0.0780 0.0777 0.0903 0.1384 0.1398 0.1661 0.1695 0.1175 0.1230 0.1038
va: 2.1338 2.0521 2.0577 2.0529 3.8784 3.8644 3.9494 3.8725 3.7954 3.8769 3.8885 3.9002 3.8544 3.8627 3.6538 3.8798 3.7706 3.9229 3.6493 3.6191 3.9472 3.9966 3.9055 3.8551 3.8963 3.8914 4.0140 3.9230 1.0118 1.0124 1.0158 1.0308 1.0090 1.0066 1.0133 1.0132 1.0090 1.0329 1.0115 1.0100 1.0089 1.0158 1.0114 1.0208 1.0179 1.0161 1.0095 1.0087 1.0080 1.0054 1.0008 1.0009 1.0041 1.0218 1.0218 0.9881 0.9887 1.0039 1.0004 1.0127
dispcorr: -0.036052056 hartree
energy: -1234.917217305761
dipole: -24.01094 24.18720 0.17625 -3.05636 3.37180 0.31544 32.61321 -32.94311 -0.32989
magnitude: 0.48928 au
magnitude: 1.24366 debye
