program: Orca
programVersion: 5.0.2
elementType: O O O O C C C C C C C C C C C C C C C C C C C C C C C C H H H H H H H H H H H H H H H H H H H H H H H H H H H H H H H H
charge: 0
multiplicity: 1
keywords: wb97x-d3
keywords: def2-TZVPP
keywords: def2/J RIJCOSX
keywords: DEFGRID2
keywords: scfconv7
keywords: smallprint printgap noloewdin
keywords: NOSOSCF
formula: C24H32O4
InChI: InChI=1/C24H32O4/c1-3-4-5-6-7-8-9-10-11-12-17-21-22(26)19-15-13-14-16-20(19)23(27)24(21)28-18(2)25/h13-16H,3-12,17H2,1-2H3
60 atoms
O  3.088456 0.079277 -1.502253
O  -0.268654 -2.609502 0.346526
O  1.173002 1.823831 -2.153718
O  2.831906 -0.228284 -3.700672
C  1.17266 -0.080258 3.706417
C  0.653581 1.348546 3.842704
C  1.906662 -0.334566 2.397957
C  -0.356715 1.782557 2.783029
C  2.493918 -1.738642 2.306099
C  -1.633374 0.949439 2.758871
C  3.303181 -2.010641 1.039283
C  -2.72013 1.563902 1.886195
C  2.502997 -2.390863 -0.215972
C  -4.032602 0.793194 1.913901
C  1.472048 -1.399944 -0.660598
C  -5.142846 1.471253 1.121903
C  1.782108 -0.263701 -1.295673
C  0.040519 -1.666383 -0.354223
C  -0.993367 -0.775672 -0.930351
C  -0.628632 0.404494 -1.581925
C  -6.41457 0.640463 1.051288
C  0.795149 0.757002 -1.714261
C  -2.335377 -1.117258 -0.825243
C  -1.604147 1.239446 -2.111572
C  -3.304224 -0.29411 -1.378766
C  -2.940761 0.884479 -2.015432
C  3.511924 0.160581 -2.791582
C  4.863557 0.77523 -2.878043
H  0.346866 -0.792263 3.804655
H  1.847014 -0.28933 4.542947
H  1.505278 2.035995 3.822461
H  0.195125 1.466576 4.829669
H  2.716588 0.395588 2.288726
H  1.225701 -0.1450 1.566504
H  -0.623192 2.826809 2.974542
H  0.102792 1.773108 1.789218
H  3.153359 -1.884893 3.166879
H  1.700478 -2.485514 2.411919
H  -1.416444 -0.06585 2.408848
H  -2.013067 0.842753 3.781605
H  3.980318 -2.84723 1.22396
H  3.941411 -1.150034 0.824708
H  -2.361658 1.637077 0.853101
H  -2.901817 2.593006 2.215694
H  2.019505 -3.352292 -0.047007
H  3.208907 -2.544538 -1.03487
H  -3.870282 -0.217872 1.52487
H  -4.359385 0.666954 2.952053
H  -4.790561 1.682323 0.107855
H  -5.362732 2.444167 1.571778
H  -6.230968 -0.320186 0.565491
H  -6.810532 0.432553 2.047308
H  -7.197257 1.149163 0.487016
H  -2.628683 -2.029506 -0.324034
H  -1.323835 2.157676 -2.609692
H  -4.347502 -0.570525 -1.304619
H  -3.699995 1.528255 -2.438082
H  5.279153 0.639263 -3.871965
H  5.538873 0.352635 -2.13558
H  4.781707 1.844841 -2.675224
elementType: O C H
totalener: -1234.88134336 hartree
nucrepener: 2783.71963768 hartree
electener: -4018.60098104 hartree
oneelecener: -7213.34973363 hartree
twoeener: 3194.74875260 hartree
cpcmener: -0.03341742 hartree
kineticenergy: 1229.31077424 hartree
xcener: -121.328684094356 hartree
chargesum: 0.0000000
charge: -0.293493 -0.434006 -0.425014 -0.436649 -0.140443 -0.168806 -0.063978 -0.114282 -0.147932 -0.133020 -0.137804 -0.119064 -0.160380 -0.133491 -0.114916 -0.104052 0.261090 0.492213 -0.080302 -0.087640 -0.282936 0.339793 -0.136860 -0.053823 -0.128654 -0.139262 0.423851 -0.231399 0.069278 0.077807 0.074576 0.075140 0.072100 -0.008525 0.078148 0.063477 0.082228 0.068235 0.053130 0.072678 0.090368 0.076617 0.038862 0.076139 0.097635 0.109339 0.064000 0.080387 0.056284 0.071553 0.074067 0.083363 0.091767 0.137767 0.138377 0.174492 0.166642 0.102701 0.119127 0.123502
qa: -0.2935 -0.4340 -0.4250 -0.4366 -0.1404 -0.1688 -0.0640 -0.1143 -0.1479 -0.1330 -0.1378 -0.1191 -0.1604 -0.1335 -0.1149 -0.1041 0.2611 0.4922 -0.0803 -0.0876 -0.2829 0.3398 -0.1369 -0.0538 -0.1287 -0.1393 0.4239 -0.2314 0.0693 0.0778 0.0746 0.0751 0.0721 -0.0085 0.0781 0.0635 0.0822 0.0682 0.0531 0.0727 0.0904 0.0766 0.0389 0.0761 0.0976 0.1093 0.0640 0.0804 0.0563 0.0716 0.0741 0.0834 0.0918 0.1378 0.1384 0.1745 0.1666 0.1027 0.1191 0.1235
va: 2.1054 2.0285 2.0615 2.0579 3.8788 3.9376 3.8073 3.8434 3.8680 3.8544 3.8940 3.8577 3.8801 3.8370 3.8446 3.8615 3.6023 3.7073 3.7094 3.6887 3.9426 4.0343 3.8970 3.8702 3.8619 3.9059 4.0521 3.9142 1.0024 1.0120 1.0090 1.0081 1.0149 1.0469 1.0108 1.0017 1.0090 1.0170 1.0084 1.0137 1.0075 1.0152 1.0180 1.0160 1.0233 1.0101 1.0040 1.0107 1.0072 1.0077 1.0021 1.0010 1.0042 1.0299 1.0198 0.9792 0.9899 1.0136 1.0023 1.0007
dispcorr: -0.035902995 hartree
energy: -1234.917246354461
dipole: -17.09890 17.11507 0.01617 7.17976 -6.96554 0.21422 33.33357 -32.83380 0.49977
magnitude: 0.54398 au
magnitude: 1.38270 debye
