program: Orca
programVersion: 5.0.2
elementType: O O O O C C C C C C C C C C C C C C C C C C C C C C C C H H H H H H H H H H H H H H H H H H H H H H H H H H H H H H H H
charge: 0
multiplicity: 1
keywords: wb97x-d3
keywords: def2-TZVPP
keywords: def2/J RIJCOSX
keywords: DEFGRID2
keywords: scfconv7
keywords: smallprint printgap noloewdin
keywords: NOSOSCF
formula: C24H32O4
InChI: InChI=1/C24H32O4/c1-3-4-5-6-7-8-9-10-11-12-17-21-22(26)19-15-13-14-16-20(19)23(27)24(21)28-18(2)25/h13-16H,3-12,17H2,1-2H3
60 atoms
O  2.82003 -0.272937 1.500918
O  1.679994 1.070853 -2.852804
O  0.541645 0.791636 2.327064
O  3.501971 1.691167 2.317262
C  0.55479 -3.353008 -0.016622
C  -0.969408 -3.36053 -0.087238
C  1.220854 -2.64092 -1.18588
C  -1.595398 -1.973905 0.009712
C  2.746257 -2.64423 -1.106436
C  -3.117808 -1.994737 -0.000802
C  3.409649 -1.575939 -1.976444
C  -3.719328 -0.598237 0.069166
C  3.602303 -0.219884 -1.276121
C  -5.240726 -0.578763 0.058743
C  2.352797 0.382082 -0.717471
C  -5.816583 0.830072 0.13145
C  2.033864 0.363498 0.582735
C  1.402881 1.018995 -1.671119
C  0.138397 1.596822 -1.158869
C  -0.156778 1.559945 0.205637
C  -7.337091 0.849048 0.139471
C  0.775203 0.908448 1.140662
C  -0.755161 2.194525 -2.039089
C  -1.332574 2.123885 0.682565
C  -1.929059 2.755609 -1.558466
C  -2.216118 2.724155 -0.200888
C  3.462488 0.495419 2.416999
C  4.064566 -0.337699 3.492466
H  0.921592 -4.383007 0.036896
H  0.867618 -2.870956 0.916909
H  -1.36142 -3.983698 0.722773
H  -1.289613 -3.839783 -1.018976
H  0.852658 -1.61478 -1.233181
H  0.909743 -3.105447 -2.127419
H  -1.245735 -1.483617 0.926046
H  -1.249217 -1.346383 -0.817578
H  3.068032 -2.516621 -0.067741
H  3.110851 -3.631305 -1.40285
H  -3.468286 -2.497523 -0.908874
H  -3.482981 -2.595297 0.839481
H  2.844786 -1.446384 -2.903021
H  4.406513 -1.905741 -2.276081
H  -3.344167 -0.004536 -0.771924
H  -3.359254 -0.096158 0.973916
H  4.040949 0.483245 -1.986852
H  4.332863 -0.344485 -0.476971
H  -5.607254 -1.07406 -0.847096
H  -5.619446 -1.168585 0.90081
H  -5.445929 1.416754 -0.715128
H  -5.439829 1.327579 1.030688
H  -7.726404 1.866435 0.19773
H  -7.74472 0.392401 -0.764481
H  -7.734703 0.296265 0.992883
H  -0.539286 2.227071 -3.098165
H  -1.562267 2.095922 1.738828
H  -2.62186 3.22031 -2.246755
H  -3.133158 3.161435 0.170114
H  4.737774 0.2576 4.102049
H  4.600623 -1.190934 3.079216
H  3.26807 -0.729039 4.128308
elementType: O C H
totalener: -1234.88190410 hartree
nucrepener: 2763.43220000 hartree
electener: -3998.31410410 hartree
oneelecener: -7172.75094784 hartree
twoeener: 3174.43684374 hartree
cpcmener: -0.03323971 hartree
kineticenergy: 1229.30851694 hartree
xcener: -121.326636565024 hartree
chargesum: -0.0000000
charge: -0.299767 -0.426724 -0.429912 -0.438346 -0.142187 -0.151098 -0.079120 -0.064038 -0.163052 -0.165955 -0.148784 -0.070535 -0.151634 -0.134586 -0.070399 -0.065373 0.250518 0.474151 -0.125171 -0.060475 -0.286903 0.338930 -0.094861 -0.082907 -0.108200 -0.161929 0.419602 -0.230977 0.081112 0.059355 0.072399 0.062540 0.018968 0.082563 0.056306 0.054200 0.067040 0.090040 0.060012 0.060753 0.080380 0.089919 0.047306 0.060271 0.104163 0.099429 0.057739 0.056316 0.050667 0.054868 0.090314 0.077901 0.078026 0.140172 0.140708 0.165410 0.165727 0.102105 0.119298 0.123722
qa: -0.2998 -0.4267 -0.4299 -0.4383 -0.1422 -0.1511 -0.0791 -0.0640 -0.1631 -0.1660 -0.1488 -0.0705 -0.1516 -0.1346 -0.0704 -0.0654 0.2505 0.4742 -0.1252 -0.0605 -0.2869 0.3389 -0.0949 -0.0829 -0.1082 -0.1619 0.4196 -0.2310 0.0811 0.0594 0.0724 0.0625 0.0190 0.0826 0.0563 0.0542 0.0670 0.0900 0.0600 0.0608 0.0804 0.0899 0.0473 0.0603 0.1042 0.0994 0.0577 0.0563 0.0507 0.0549 0.0903 0.0779 0.0780 0.1402 0.1407 0.1654 0.1657 0.1021 0.1193 0.1237
va: 2.0783 2.0634 2.0450 2.0558 3.9064 3.9402 3.8201 3.8444 3.8755 3.9671 3.8806 3.8756 3.8683 3.9077 3.8040 3.8590 3.6164 3.8154 3.7148 3.6092 3.9574 3.9924 3.9458 3.8276 3.8896 3.8969 4.0628 3.9127 1.0087 1.0129 1.0104 1.0096 1.0297 1.0126 1.0133 1.0056 1.0160 1.0075 1.0082 1.0107 1.0157 1.0087 1.0098 1.0059 1.0164 1.0165 1.0075 1.0090 1.0067 1.0056 1.0035 1.0003 1.0006 1.0218 1.0239 0.9897 0.9896 1.0140 1.0021 1.0006
dispcorr: -0.035017546 hartree
energy: -1234.916921645856
dipole: -31.88188 31.34164 -0.54024 -24.22598 23.40801 -0.81798 -2.74935 2.56833 -0.18103
magnitude: 0.99685 au
magnitude: 2.53379 debye
