program: Gaussian 09
title: 000054968
version: EM64L-G09RevD.01
frameworkgroup: C1[X(C9H13N3)]
method: RPBEPBE
basis: SDD
operation: Freq
keyword: #pfreq=noraman
keyword: PBEPBE/SDD
title: #p freq=noraman PBEPBE/SDD
converged: YES YES NO NO
title: Mulliken charges:
elementType: N N N C C C C C C C C C H H H H H H H H H H H H H
charge: -0.080597 -0.094466 -0.052678 0.265154 -0.122569 -0.351458 -0.396743 0.189074 -0.614585 -0.645072 -0.772308 -0.424671 0.286020 0.229403 0.221941 0.238427 0.231255 0.231835 0.245951 0.241027 0.229592 0.227020 0.255388 0.227132 0.235928
chargesum: 0.00000
title: Mulliken charges with hydrogens summed into heavy atoms:
elementType: N N N C C C C C C C C C
charge: -0.080597 -0.094466 -0.052678 0.265154 0.163451 -0.122055 -0.174802 0.189074 0.086933 0.071498 -0.062768 -0.188743
polarizability: 2.33569362e+02 2.20459185e-01 1.16682642e+02 4.49599385e-01 -5.64339817e-01 6.41362316e+01
1716.lowfreq: -76.0159 -8.0690 0.0000 0.0005 0.0009 2.4076 9.9516 44.5084 69.3599
frequency: -76.0063 44.4925 69.3583 83.7719 92.8233 139.0694 182.3089 206.7804 235.7840 259.4517 267.3162 363.9249 374.7877 435.7672 445.4716 529.4099 537.8019 608.6129 658.2680 768.2667 800.4781 809.3255 862.6778 895.2957 907.4052 936.8133 948.9523 974.6139 995.2777 1049.2409 1059.2420 1092.2660 1095.5435 1129.8566 1161.9587 1195.6728 1233.7247 1259.7509 1292.7610 1305.6073 1321.4521 1357.8887 1387.4055 1420.1595 1429.7871 1434.3831 1441.3014 1455.0225 1463.1005 1469.0011 1470.5880 1488.5909 1490.8120 1506.9746 1570.1922 1651.7332 2951.7077 2958.5448 2984.2693 3029.7165 3032.6751 3063.6832 3098.0492 3103.1530 3117.2395 3132.6110 3135.0244 3137.4472 3143.4070
redmass: 1.0284 2.6938 3.2327 1.8282 2.4013 1.2047 2.1613 4.0265 3.6334 3.3380 2.9450 2.4454 2.8937 2.4764 2.8369 4.0395 5.1464 4.2168 6.3401 3.5130 5.5349 1.5855 3.7680 1.5534 3.4635 6.3320 1.4171 1.2143 1.6115 1.6109 1.5010 1.4431 1.3941 1.3594 1.5848 2.7210 3.4395 3.6602 1.5376 3.2682 1.6241 2.4090 1.2757 1.8660 1.8629 1.2362 1.7327 1.2610 1.0513 1.0468 1.0444 1.6479 1.0695 1.6846 6.0451 5.4190 1.0377 1.0393 1.0379 1.0993 1.0976 1.0973 1.0981 1.0981 1.0983 1.0922 1.0937 1.0921 1.0874
irintensity: 0.2109 3.2817 0.4666 2.0217 0.9565 0.3164 2.4258 2.1195 1.5389 0.8237 0.8907 2.6832 1.4577 14.9775 1.0057 1.5090 5.7990 0.6045 11.1561 0.5560 1.8397 23.8021 20.2191 40.6143 4.2723 27.7614 3.5737 33.4564 2.2292 11.1477 17.7088 92.3388 76.3899 11.2091 9.8236 21.9642 7.7799 6.5597 39.0615 11.0758 12.1157 126.9400 8.8887 76.0040 12.4864 35.2132 143.7115 3.1677 28.8342 16.5942 2.1777 6.9868 19.0776 93.1307 620.4364 688.8696 56.0216 158.4754 19.7399 42.4036 33.4115 20.2620 6.2858 31.8746 11.2903 21.2741 31.4679 4.8702 12.8255
temp: 298.150 k
press: 1.00000 atm
elementType: 7 7 7 6 6 6 6 6 6 6 6 6 1 1 1 1 1 1 1 1 1 1 1 1 1
symmnumber: 1
zpe: 541644.3 jmol-1
zpe.correction: 0.206301 hartree
zpe.thermalcorrener: 0.218344 hartree
zpe.thermalcorrenthalpy: 0.219289 hartree
zpe.thermalcorrgfe: 0.167312 hartree
zpe.sumelectzpe: -514.091428 hartree
zpe.sumelectthermal: -514.079385 hartree
zpe.sumelectthermalent: -514.078440 hartree
zpe.sumelectthermalfe: -514.130417 hartree
dipole: 5.6084 -2.8437 0.1561
dipole: 6.2901
quadrupole: -58.9112 -67.3521 -75.3620
quadrupole: 6.1784 0.2388 0.1209
quadrupole: 8.2972 -0.1436 -8.1536 6.1784 0.2388 0.1209
hfenergy: -514.2977291 hartree
pointgroup: C01 [X(C9H13N3)]
dipole: -2.2252525 -1.0759176 -0.1217942 debye
dipolederiv: -2.1210541 0.0859289 -0.0320261 -0.2895517 -0.397513 -0.0154474 0.2200234 -0.0032627 -0.2841799 -0.9094907 -0.1029379 -0.0119853 -0.667555 -0.5599272 -0.0243637 -0.0362599 -0.0166459 -0.22364 -0.7730614 0.1373268 0.0014798 -0.1503268 -0.763033 -0.0294251 -0.0110109 -0.0237017 -0.2255498 2.0995799 0.1977172 0.0324974 0.4610838 0.2399885 0.011881 0.037593 0.0039977 0.1301371 2.276931 -0.0559167 0.0110419 -0.3903638 0.0078811 0.0070388 -0.0783239 0.0181583 -0.0153431 -1.7961695 -0.0672364 -0.022216 0.5522993 0.020168 0.0304781 -0.0225658 0.0207233 -0.3907667 -1.3584872 0.0502301 -0.0119853 0.2512521 -0.0366947 0.0085297 0.006948 0.0066444 -0.1589115 1.1341121 -0.2137695 0.0017627 0.0835921 0.5451152 0.0270635 0.0135126 0.0232153 0.0381202 0.6130938 -0.2311077 0.037188 -0.5694798 0.2323264 -0.0306979 -0.0486883 -0.0257807 0.2718377 0.2042818 0.0779298 -0.0008966 0.5233115 0.373824 0.046873 -0.0320143 0.0278353 0.2681113 -0.1736598 0.1450863 0.0048717 0.2669453 -0.1224378 -0.0057625 0.010452 -0.0070358 0.0474415 0.6522043 -0.031752 0.0031011 0.1758679 0.6352862 0.033338 0.0112001 0.0303206 -0.0295641 0.160121 0.002499 0.0034418 -0.0027022 -0.0176565 -0.0054902 0.0247238 -0.0070027 0.1607343 0.0305955 -0.0071441 -0.0025381 -0.070125 -0.0991447 -0.0169443 -0.0043742 -0.013286 0.2014395 0.0910817 -0.0453681 -0.0023016 -0.0166169 -0.118936 -0.0135577 -0.0016728 -0.0135257 0.1513937 0.0639746 -0.1164686 -0.0213933 -0.0209112 -0.0772406 -0.0140521 -0.0081001 -0.0182216 0.1180336 -0.1749796 0.0525703 0.1041577 0.0356074 0.0780116 0.0567638 0.1770547 0.0105778 -0.044481 -0.1438124 0.0713046 -0.0932829 0.1290877 0.0668923 -0.0376967 -0.2254365 0.0312121 -0.1227628 0.1146265 0.1000687 -0.1050432 -0.0485448 -0.0288764 0.0556913 -0.0112458 0.0872702 -0.0369405 0.1025781 0.0477716 0.075601 -0.1293265 -0.0339924 -0.0597464 -0.0513189 -0.1184121 -0.1119158 -0.1792249 -0.0478261 0.0317173 0.0075796 0.0936061 -0.0145141 0.0358189 -0.0042204 0.1103886 0.0412289 0.0111392 -0.0290251 0.0393895 0.0315957 -0.1073778 0.0362183 -0.1219602 -0.0536111 -0.0552035 -0.0404151 -0.0033448 -0.1522426 0.0551585 -0.0041968 -0.0085389 -0.0033299 0.1174102 0.0411446 0.0063353 0.030971 0.0409109 0.0092981 0.1139819 -0.0310644 0.1279627 -0.0311792 0.0595895 -0.0259657 -0.0017931 -0.0591807 -0.1336997 -0.0123666 -0.0029302 -0.0115323 0.1137978 unknown
polarizability: 233.4898579|-2.3888758|116.6416102|2.38313|2.1905876|64.2567675 unknown
InChI: InChI=1S/C9H13N3/c1-8-6-9(11-7-10-8)4-5-12(2)3/h4-7H,1-3H3
charge 0 multiplicity 1
25 atoms
N  -3.36687 -0.070487 0.008078
N  0.631848 1.249318 0.083153
N  3.050496 0.879438 0.082159
C  0.409613 -0.122783 0.014866
C  -2.032779 0.262225 0.008401
C  -0.958958 -0.610907 -0.019037
C  1.525736 -1.011449 -0.021705
C  2.834103 -0.481233 0.01437
C  -4.409633 0.960874 -0.091757
C  -3.781937 -1.478575 -0.042519
C  4.061079 -1.366963 -0.018411
C  1.923382 1.656673 0.111347
H  -1.799373 1.332715 0.043275
H  -1.098839 -1.695848 -0.07378
H  1.367479 -2.094237 -0.076491
H  -3.954347 1.958382 0.017934
H  -5.165992 0.835423 0.706431
H  -4.928801 0.924046 -1.070973
H  -3.290867 -2.055284 0.764013
H  -3.516563 -1.947656 -1.012069
H  -4.87313 -1.549497 0.093736
H  4.087757 -1.979326 -0.939072
H  4.965675 -0.740597 0.01832
H  4.074005 -2.06386 0.840325
H  2.091217 2.738807 0.161907
