program: Orca
programVersion: 5.0.2
elementType: O O O O C C C C C C C C C C C C C C C C C C C C C C C C H H H H H H H H H H H H H H H H H H H H H H H H H H H H H H H H
charge: 0
multiplicity: 1
keywords: wb97x-d3
keywords: def2-TZVPP
keywords: def2/J RIJCOSX
keywords: DEFGRID2
keywords: scfconv7
keywords: smallprint printgap noloewdin
keywords: NOSOSCF
formula: C24H32O4
InChI: InChI=1/C24H32O4/c1-3-4-5-6-7-8-9-10-11-12-17-21-22(26)19-15-13-14-16-20(19)23(27)24(21)28-18(2)25/h13-16H,3-12,17H2,1-2H3
60 atoms
O  1.598445 -1.838517 -1.83124
O  2.334351 2.507614 -0.252203
O  -0.892676 -1.08332 -2.427871
O  0.27774 -2.801599 -0.300198
C  1.658992 0.246815 3.406559
C  0.393961 0.605636 2.63263
C  2.884257 0.091256 2.505543
C  -0.869993 0.603067 3.48349
C  2.812457 -1.169267 1.64458
C  -2.148967 0.825212 2.679387
C  3.715472 -1.189204 0.418023
C  -2.514118 -0.334482 1.75777
C  3.47213 -0.064561 -0.605082
C  -3.838368 -0.122425 1.036082
C  2.038146 0.268725 -0.90267
C  -4.158128 -1.216638 0.026059
C  1.176658 -0.594875 -1.455536
C  1.559949 1.655262 -0.63841
C  0.131436 1.983669 -0.855557
C  -0.73124 1.054593 -1.438692
C  -5.429322 -0.9362 -0.760323
C  -0.22197 -0.270983 -1.824496
C  -0.351091 3.233044 -0.48717
C  -2.062203 1.380889 -1.664817
C  -1.68456 3.549878 -0.69981
C  -2.53793 2.627709 -1.289819
C  1.031412 -2.915959 -1.227663
C  1.473448 -4.183193 -1.869402
H  1.496885 -0.685366 3.95958
H  1.849124 1.016175 4.160687
H  0.266086 -0.089249 1.797881
H  0.519144 1.595653 2.180491
H  3.793245 0.061346 3.112601
H  2.975233 0.985381 1.883278
H  -0.947172 -0.349727 4.019206
H  -0.785805 1.375848 4.25373
H  3.05869 -2.034366 2.26665
H  1.783148 -1.332089 1.32106
H  -2.979952 0.998835 3.370277
H  -2.052545 1.741793 2.08559
H  3.619082 -2.161567 -0.068315
H  4.76243 -1.114018 0.722969
H  -2.563633 -1.259576 2.342936
H  -1.72516 -0.491609 1.014105
H  3.963927 -0.338113 -1.542195
H  3.968889 0.841624 -0.265978
H  -4.648906 -0.057301 1.770113
H  -3.820365 0.84507 0.523398
H  -4.249425 -2.175846 0.54453
H  -3.317727 -1.327236 -0.666708
H  -5.653384 -1.737728 -1.465472
H  -6.291332 -0.831231 -0.098562
H  -5.342466 -0.01015 -1.332918
H  0.307037 3.959821 -0.0314
H  -2.729844 0.663564 -2.123071
H  -2.057833 4.521059 -0.404587
H  -3.576415 2.878905 -1.457527
H  0.988235 -4.281746 -2.842337
H  1.198317 -5.03461 -1.25418
H  2.549206 -4.184591 -2.039022
elementType: O C H
totalener: -1234.88048215 hartree
nucrepener: 2865.96627844 hartree
electener: -4100.84676058 hartree
oneelecener: -7378.47341838 hartree
twoeener: 3277.62665780 hartree
cpcmener: -0.03266438 hartree
kineticenergy: 1229.29138100 hartree
xcener: -121.328422740082 hartree
chargesum: -0.0000000
charge: -0.287422 -0.428082 -0.424810 -0.440235 -0.157005 -0.055958 -0.142026 -0.149787 -0.130302 -0.112763 -0.151494 -0.089554 -0.170780 -0.140455 0.025102 -0.090036 0.161850 0.366320 -0.069841 -0.057550 -0.284624 0.379826 -0.105503 -0.115285 -0.110949 -0.135218 0.432758 -0.229997 0.063092 0.074909 0.006165 0.058199 0.084298 0.070708 0.060189 0.075146 0.085402 0.057853 0.079309 0.051116 0.084178 0.089065 0.077589 0.014578 0.111830 0.103878 0.084678 0.053037 0.070396 0.043166 0.092334 0.082553 0.075900 0.138739 0.147448 0.164719 0.166602 0.125092 0.103426 0.118223
qa: -0.2874 -0.4281 -0.4248 -0.4402 -0.1570 -0.0560 -0.1420 -0.1498 -0.1303 -0.1128 -0.1515 -0.0896 -0.1708 -0.1405 0.0251 -0.0900 0.1619 0.3663 -0.0698 -0.0576 -0.2846 0.3798 -0.1055 -0.1153 -0.1109 -0.1352 0.4328 -0.2300 0.0631 0.0749 0.0062 0.0582 0.0843 0.0707 0.0602 0.0751 0.0854 0.0579 0.0793 0.0511 0.0842 0.0891 0.0776 0.0146 0.1118 0.1039 0.0847 0.0530 0.0704 0.0432 0.0923 0.0826 0.0759 0.1387 0.1474 0.1647 0.1666 0.1251 0.1034 0.1182
va: 2.1294 2.0467 2.0536 2.0533 3.9607 3.8478 3.8617 3.9346 3.8652 3.8899 3.9034 3.8598 3.8391 3.8659 3.6564 3.8635 3.8284 3.8731 3.6854 3.5760 3.9436 3.9824 3.9228 3.8504 3.9053 3.8864 4.0129 3.9196 1.0064 1.0090 1.0100 1.0115 1.0123 1.0199 1.0102 1.0099 1.0118 1.0028 1.0118 1.0136 1.0091 1.0079 1.0148 1.0106 1.0059 1.0234 1.0099 1.0071 1.0087 1.0107 1.0041 1.0012 1.0006 1.0238 1.0080 0.9885 0.9907 1.0005 1.0130 1.0032
dispcorr: -0.038988346 hartree
energy: -1234.919470493769
dipole: -13.60016 13.86815 0.26799 -7.72503 7.94877 0.22374 24.43014 -24.85315 -0.42301
magnitude: 0.54847 au
magnitude: 1.39409 debye
