program: Gaussian 09
title: 000054996
version: EM64L-G09RevD.01
frameworkgroup: C1[X(C17H17N3OS)]
method: RPBEPBE
basis: SDD
operation: Freq
keyword: #p
keyword: freq=noraman
keyword: PBEPBE/SDD
title: #p freq=noraman PBEPBE/SDD
converged: YES YES NO NO
title: Mulliken charges:
elementType: S O N N N C C C C C C C C C C C C C C C C C H H H H H H H H H H H H H H H H H
charge: 0.278543 -0.258028 -0.463777 -0.401082 -0.118086 0.106700 0.328429 0.373610 0.271948 0.051592 -0.375234 -0.456539 -0.860578 -0.186005 -0.233431 -0.846274 -0.810149 0.254424 -0.352276 -0.308372 -0.208641 -0.242761 0.306612 0.403977 0.227586 0.257270 0.226165 0.251432 0.325391 0.223345 0.230261 0.228071 0.231753 0.297879 0.303164 0.238701 0.244809 0.229763 0.229810
chargesum: 0.00000
title: Mulliken charges with hydrogens summed into heavy atoms:
elementType: S O N N N C C C C C C C C C C C C C C C C C
charge: 0.278543 -0.258028 -0.059800 -0.075691 -0.118086 0.106700 0.328429 0.373610 0.271948 0.051592 -0.068621 -0.228953 -0.125711 -0.186005 -0.010085 -0.156190 -0.209106 0.254424 -0.113575 -0.063563 0.021121 -0.012951
polarizability: 2.86971626e+02 -2.21981773e+01 2.83806766e+02 -4.63588119e+00 -1.07357360e+01 1.26050104e+02
1716.lowfreq: -8.4697 -3.6188 -0.0007 0.0009 0.0020 4.3918 16.2684 30.6527 38.9188
frequency: 15.7585 30.6470 38.9153 61.0343 79.8009 98.2663 117.8549 130.9704 151.9170 180.5054 187.1773 200.1072 239.7343 251.4481 258.4967 280.1266 302.4530 316.2400 344.0961 363.8488 381.5690 428.9594 448.1590 480.0049 491.2354 504.4200 518.3477 556.7408 574.0896 578.9226 579.5687 586.1437 614.1136 624.4640 652.9439 728.2171 730.6942 752.9125 755.1047 762.8964 794.5260 798.9959 803.4962 851.8468 855.3939 880.5394 905.4569 912.7395 916.3133 935.2614 942.3539 944.6511 976.9757 990.1024 996.1116 1011.0466 1030.0533 1051.9361 1075.2604 1097.2681 1110.7862 1150.3127 1160.4559 1169.6946 1184.2836 1199.7792 1207.2557 1242.5522 1247.1124 1261.6476 1263.5554 1282.0283 1292.9964 1349.9493 1369.5051 1395.0862 1403.1096 1406.1592 1413.9727 1420.4378 1438.2795 1453.2445 1459.0079 1468.8091 1473.6170 1479.0411 1491.6443 1497.0572 1554.0964 1595.7959 1599.2252 1606.1996 1628.1910 1634.6793 2971.5482 2972.0964 3043.6980 3046.6603 3049.2726 3082.3156 3105.7010 3122.3913 3135.9994 3145.7275 3148.1677 3148.4112 3163.9777 3177.5483 3198.0541 3216.8559 3598.0346
redmass: 3.9872 4.5763 7.7240 4.8166 4.6098 6.1311 6.1235 3.4597 1.5555 2.3589 3.7792 1.2011 2.5867 4.7571 5.5524 5.4941 6.3449 3.8279 2.6884 3.1502 9.9409 3.0255 3.4520 5.4006 4.1721 3.1430 4.5798 6.0153 1.7521 3.1731 2.9894 4.4530 6.5232 5.5365 5.7021 5.1884 2.5494 1.4193 4.5132 3.7960 5.0903 1.5674 3.9714 2.4706 1.4589 6.0292 1.6232 1.5005 1.3677 1.3779 7.3717 3.1454 1.3051 1.3269 1.4394 2.0910 1.4324 1.6164 2.0743 1.8376 1.7276 1.2050 1.3348 1.5362 1.4579 2.2957 2.6874 2.5881 1.2112 3.0006 1.8989 1.9665 2.9541 3.7326 6.2769 1.2902 1.2223 1.7944 2.8455 1.6701 2.3297 2.0883 3.4218 1.1056 1.2716 2.7489 1.1214 1.0912 2.2068 6.8446 6.5171 7.4083 4.5407 3.1201 1.0379 1.0401 1.0971 1.0974 1.0592 1.0979 1.0945 1.0872 1.0857 1.1065 1.0960 1.0909 1.0963 1.0984 1.0946 1.0841 1.0816
irintensity: 0.1731 1.7345 1.9148 3.2206 1.7806 0.8797 2.4235 1.6425 0.8052 3.2288 3.1451 3.1824 1.3563 10.5730 3.6064 5.4145 0.7522 5.4470 0.0891 2.7537 6.6780 9.8952 0.6391 7.5041 3.2105 0.0947 7.8162 13.2827 49.3757 11.0536 19.1291 11.5528 1.3318 14.5947 10.1199 6.7014 10.0985 93.1657 22.1232 7.4921 2.2030 51.1776 1.2607 6.0770 0.1867 6.9267 36.0453 24.8089 10.5780 4.2621 14.7993 1.1607 0.1027 2.4052 8.4798 7.9075 10.9612 0.6209 2.5803 22.2681 2.7394 38.7361 1.7335 13.9369 0.8180 2.4639 12.0337 12.8189 2.6744 51.0333 0.6643 10.9478 45.5682 111.3869 27.5096 4.8599 5.4488 111.8963 7.5860 114.3349 16.2747 16.5010 21.0702 26.5657 43.9447 13.8837 39.9898 31.8949 243.5161 8.4865 75.8446 93.9434 36.3128 96.9159 32.3386 30.7375 16.2701 20.7205 6.0315 26.3658 14.5928 11.5489 0.2013 0.0987 37.8456 10.4308 28.3857 12.2709 10.3318 478.9599 67.8863
temp: 298.150 k
press: 1.00000 atm
elementType: 16 8 7 7 7 6 6 6 6 6 6 6 6 6 6 6 6 6 6 6 6 6 1 1 1 1 1 1 1 1 1 1 1 1 1 1 1 1 1
symmnumber: 1
zpe: 803922.0 jmol-1
zpe.correction: 0.306198 hartree
zpe.thermalcorrener: 0.326058 hartree
zpe.thermalcorrenthalpy: 0.327002 hartree
zpe.thermalcorrgfe: 0.256225 hartree
zpe.sumelectzpe: -1294.024765 hartree
zpe.sumelectthermal: -1294.004905 hartree
zpe.sumelectthermalent: -1294.003961 hartree
zpe.sumelectthermalfe: -1294.074738 hartree
dipole: 6.0535 -2.5641 -0.4746
dipole: 6.5913
quadrupole: -123.1086 -133.1798 -136.8008
quadrupole: 12.7838 -5.3804 -2.6362
quadrupole: 7.9211 -2.1501 -5.7711 12.7838 -5.3804 -2.6362
hfenergy: -1294.3309627 hartree
pointgroup: C01 [X(C17H17N3O1S1)]
dipole: 2.3055458 -1.1708743 -0.1956523 debye
polarizability: 282.7297017|-25.9563855|278.5833142|-14.7824423|-34.2996685|135.5154798 unknown
InChI: InChI=1S/C17H17N3OS/c1-11-6-5-9-13(12(11)2)18-16(21)10-22-17-19-14-7-3-4-8-15(14)20-17/h3-9,18-19H,10H2,1-2H3
charge 0 multiplicity 1
39 atoms
S  1.177638 2.983149 -1.225361
O  -2.298761 3.536514 -0.078321
N  -1.49577 1.326561 0.226937
N  3.054697 0.926268 -1.404027
N  1.387229 0.510299 0.09577
C  -2.641644 -0.837545 0.398038
C  -2.700389 0.564678 0.107253
C  -3.821863 -1.623499 0.25954
C  3.352205 -0.333293 -0.848414
C  2.300897 -0.576863 0.098875
C  -3.923323 1.170781 -0.28842
C  -5.03183 -1.005978 -0.14718
C  -1.330481 -1.464836 0.843133
C  1.881601 1.381358 -0.801722
C  -5.079748 0.377912 -0.412194
C  -3.819354 -3.119543 0.542225
C  0.071652 3.214906 0.315213
C  -1.362058 2.702928 0.126636
C  4.40255 -1.245015 -1.067447
C  2.299688 -1.767478 0.858719
C  4.383225 -2.43006 -0.29899
C  3.350481 -2.685283 0.64789
H  -3.949268 2.24323 -0.48381
H  -0.59866 0.813926 0.3506
H  -5.936205 -1.616882 -0.250729
H  -0.58585 -1.482771 0.024505
H  -0.8742 -0.902178 1.680562
H  -1.471753 -2.502733 1.180065
H  3.61122 1.439711 -2.085373
H  -6.021454 0.846322 -0.719335
H  -3.093712 -3.661044 -0.093683
H  -3.560183 -3.342464 1.595184
H  -4.816874 -3.549482 0.349522
H  0.031861 4.304105 0.457281
H  0.603325 2.725141 1.146904
H  5.2008 -1.054018 -1.7918
H  1.511145 -1.964119 1.590525
H  5.181398 -3.167836 -0.433369
H  3.374666 -3.61567 1.224997
