program: Orca
programVersion: 5.0.2
elementType: O O O O C C C C C C C C C C C C C C C C C C C C C C C C H H H H H H H H H H H H H H H H H H H H H H H H H H H H H H H H
charge: 0
multiplicity: 1
keywords: wb97x-d3
keywords: def2-TZVPP
keywords: def2/J RIJCOSX
keywords: DEFGRID2
keywords: scfconv7
keywords: smallprint printgap noloewdin
keywords: NOSOSCF
formula: C24H32O4
InChI: InChI=1/C24H32O4/c1-3-4-5-6-7-8-9-10-11-12-17-21-22(26)19-15-13-14-16-20(19)23(27)24(21)28-18(2)25/h13-16H,3-12,17H2,1-2H3
60 atoms
O  1.254193 -2.512769 -0.46241
O  2.275804 1.185708 2.237829
O  -1.280885 -2.258539 0.306305
O  1.118808 -4.036214 1.166794
C  2.104057 3.166806 -2.719598
C  0.771978 3.305391 -1.979526
C  2.777387 1.801693 -2.573211
C  -0.241337 2.208733 -2.285187
C  2.907888 1.32967 -1.131321
C  -1.528722 2.336653 -1.480687
C  3.427249 -0.098528 -1.021628
C  -2.471236 1.157361 -1.683971
C  3.284559 -0.707724 0.382157
C  -3.786885 1.301914 -0.930248
C  1.863271 -0.662487 0.853842
C  -4.66299 0.054125 -0.96843
C  0.934402 -1.527161 0.428863
C  1.446219 0.426387 1.77867
C  0.013294 0.565708 2.129025
C  -0.92808 -0.349147 1.651886
C  -5.139345 -0.322038 -2.364199
C  -0.503638 -1.449271 0.770587
C  -0.397064 1.610595 2.946929
C  -2.2670 -0.216014 1.994444
C  -1.736219 1.742095 3.283342
C  -2.66918 0.829807 2.810609
C  1.256143 -3.790152 0.000253
C  1.447225 -4.762207 -1.109598
H  2.782618 3.947513 -2.363343
H  1.949992 3.365869 -3.784329
H  0.334773 4.278301 -2.223897
H  0.952705 3.329704 -0.900251
H  3.764192 1.835644 -3.044452
H  2.207558 1.053949 -3.133577
H  -0.474777 2.209602 -3.355417
H  0.197246 1.228013 -2.075172
H  3.549401 2.011399 -0.564043
H  1.921527 1.385175 -0.665213
H  -1.282293 2.417399 -0.415259
H  -2.039823 3.268893 -1.744782
H  4.480721 -0.14089 -1.307873
H  2.891323 -0.729195 -1.735708
H  -1.96895 0.23873 -1.358397
H  -2.665256 1.031471 -2.753812
H  3.921484 -0.172652 1.085334
H  3.63627 -1.740365 0.3656
H  -3.571789 1.551635 0.113479
H  -4.347125 2.152254 -1.334699
H  -5.532638 0.211245 -0.324677
H  -4.11129 -0.785866 -0.533321
H  -5.826347 -1.168839 -2.332516
H  -5.666562 0.509056 -2.837805
H  -4.312519 -0.601506 -3.018535
H  0.323934 2.32374 3.322467
H  -2.996805 -0.923176 1.624514
H  -2.051162 2.559009 3.91829
H  -3.712721 0.934016 3.074658
H  0.586028 -4.729966 -1.778663
H  1.554297 -5.769015 -0.717399
H  2.32728 -4.506233 -1.699451
elementType: O C H
totalener: -1234.88150210 hartree
nucrepener: 2793.15285043 hartree
electener: -4028.03435253 hartree
oneelecener: -7232.17426949 hartree
twoeener: 3204.13991696 hartree
cpcmener: -0.03375389 hartree
kineticenergy: 1229.30844304 hartree
xcener: -121.328582153585 hartree
chargesum: 0.0000000
charge: -0.300122 -0.425807 -0.429658 -0.437616 -0.177397 -0.121465 -0.135626 -0.127552 -0.095385 -0.131236 -0.146098 -0.135182 -0.134317 -0.117475 -0.074440 -0.109988 0.237351 0.433512 -0.105751 -0.025315 -0.279867 0.322749 -0.103078 -0.111399 -0.106634 -0.144281 0.422857 -0.228391 0.074407 0.074429 0.081753 0.064053 0.080696 0.069564 0.079378 0.054488 0.086590 0.009573 0.045901 0.075501 0.086974 0.076732 0.051435 0.082744 0.099421 0.108049 0.061319 0.081988 0.072804 0.040602 0.091921 0.080703 0.081493 0.137636 0.159182 0.166850 0.166864 0.122628 0.101382 0.120549
qa: -0.3001 -0.4258 -0.4297 -0.4376 -0.1774 -0.1215 -0.1356 -0.1276 -0.0954 -0.1312 -0.1461 -0.1352 -0.1343 -0.1175 -0.0744 -0.1100 0.2374 0.4335 -0.1058 -0.0253 -0.2799 0.3227 -0.1031 -0.1114 -0.1066 -0.1443 0.4229 -0.2284 0.0744 0.0744 0.0818 0.0641 0.0807 0.0696 0.0794 0.0545 0.0866 0.0096 0.0459 0.0755 0.0870 0.0767 0.0514 0.0827 0.0994 0.1080 0.0613 0.0820 0.0728 0.0406 0.0919 0.0807 0.0815 0.1376 0.1592 0.1668 0.1669 0.1226 0.1014 0.1205
va: 2.1070 2.0537 2.0459 2.0578 3.9218 3.8526 3.8910 3.8431 3.8168 3.8936 3.8973 3.8652 3.8585 3.8609 3.8047 3.8838 3.7273 3.8387 3.7244 3.5542 3.9361 4.0121 3.9406 3.8518 3.9153 3.9066 4.0577 3.9087 1.0074 1.0081 1.0080 1.0021 1.0095 1.0013 1.0118 1.0069 1.0139 1.0286 1.0102 1.0129 1.0135 1.0149 1.0079 1.0083 1.0266 1.0131 1.0140 1.0088 1.0067 1.0171 1.0046 1.0008 0.9975 1.0232 1.0022 0.9876 0.9896 1.0016 1.0142 1.0009
dispcorr: -0.035108298 hartree
energy: -1234.916610393969
dipole: -11.63963 11.42493 -0.21470 19.63515 -18.92010 0.71505 -30.80071 29.97897 -0.82174
magnitude: 1.11025 au
magnitude: 2.82202 debye
