program: Orca
programVersion: 5.0.2
elementType: O O O O C C C C C C C C C C C C C C C C C C C C C C C C H H H H H H H H H H H H H H H H H H H H H H H H H H H H H H H H
charge: 0
multiplicity: 1
keywords: wb97x-d3
keywords: def2-TZVPP
keywords: def2/J RIJCOSX
keywords: DEFGRID2
keywords: scfconv7
keywords: smallprint printgap noloewdin
keywords: NOSOSCF
formula: C24H32O4
InChI: InChI=1/C24H32O4/c1-3-4-5-6-7-8-9-10-11-12-17-21-22(26)19-15-13-14-16-20(19)23(27)24(21)28-18(2)25/h13-16H,3-12,17H2,1-2H3
60 atoms
O  2.389571 -1.797247 -1.927192
O  2.188989 2.691925 -0.613187
O  -0.16281 -1.57119 -2.661704
O  1.234929 -2.892934 -0.357521
C  1.250353 -1.251802 2.917332
C  -0.152512 -0.871106 3.381014
C  1.953799 -0.160923 2.121225
C  -1.094318 -0.461937 2.252814
C  3.369467 -0.539494 1.700017
C  -2.540624 -0.322072 2.710138
C  4.060261 0.510256 0.830488
C  -3.4500 0.254948 1.633932
C  3.79338 0.385723 -0.678121
C  -4.914292 0.318305 2.048891
C  2.354186 0.402747 -1.084838
C  -5.834033 0.923813 0.991489
C  1.720025 -0.641765 -1.632833
C  1.601257 1.676366 -0.926808
C  0.138038 1.681086 -1.157098
C  -0.491388 0.566021 -1.713779
C  -5.616694 2.413463 0.764827
C  0.301269 -0.625884 -2.058164
C  -0.61084 2.807542 -0.841308
C  -1.858923 0.583029 -1.956156
C  -1.978291 2.815595 -1.07268
C  -2.600935 1.707481 -1.631457
C  2.024081 -2.921755 -1.262336
C  2.710078 -4.122653 -1.811342
H  1.190883 -2.158461 2.307145
H  1.857691 -1.514936 3.78908
H  -0.090688 -0.054124 4.108049
H  -0.586982 -1.719977 3.91924
H  1.993033 0.760011 2.714536
H  1.352168 0.077219 1.240818
H  -0.765745 0.488512 1.819687
H  -1.03761 -1.196526 1.44073
H  3.966315 -0.699472 2.602506
H  3.360381 -1.502973 1.178877
H  -2.917208 -1.300354 3.027981
H  -2.581572 0.31983 3.597174
H  5.142281 0.426043 0.947823
H  3.799836 1.510078 1.184383
H  -3.362215 -0.346352 0.721695
H  -3.088243 1.253634 1.370394
H  4.258161 -0.53287 -1.03284
H  4.303937 1.204675 -1.190635
H  -5.256766 -0.694398 2.282917
H  -5.007811 0.890799 2.978621
H  -6.873448 0.76068 1.288317
H  -5.702398 0.385404 0.047376
H  -6.306968 2.804939 0.016032
H  -5.778722 2.978036 1.685546
H  -4.606132 2.63652 0.419444
H  -0.132824 3.676937 -0.410566
H  -2.346643 -0.279012 -2.390888
H  -2.560089 3.690656 -0.816282
H  -3.668243 1.716507 -1.808202
H  2.632115 -4.953011 -1.11552
H  3.757858 -3.920703 -2.028209
H  2.228853 -4.407669 -2.749363
elementType: O C H
totalener: -1234.88163799 hartree
nucrepener: 2787.15235149 hartree
electener: -4022.03398948 hartree
oneelecener: -7220.81153342 hartree
twoeener: 3198.77754394 hartree
cpcmener: -0.03300423 hartree
kineticenergy: 1229.30411166 hartree
xcener: -121.327516950169 hartree
chargesum: 0.0000000
charge: -0.290297 -0.425451 -0.423339 -0.446739 -0.161806 -0.144117 -0.043868 -0.053601 -0.142398 -0.154506 -0.151470 -0.092184 -0.149344 -0.128054 -0.046158 -0.107230 0.233998 0.376495 -0.051145 -0.081867 -0.270857 0.366489 -0.085168 -0.095218 -0.135971 -0.144276 0.444512 -0.232899 0.063887 0.075562 0.066239 0.068732 0.074915 -0.030281 0.045019 0.058647 0.087238 0.063769 0.059229 0.058973 0.090956 0.078861 0.058090 0.054147 0.097838 0.109013 0.068680 0.060763 0.074006 0.054384 0.093959 0.085368 0.057123 0.138882 0.138268 0.167167 0.171571 0.103717 0.117524 0.124226
qa: -0.2903 -0.4255 -0.4233 -0.4467 -0.1618 -0.1441 -0.0439 -0.0536 -0.1424 -0.1545 -0.1515 -0.0922 -0.1493 -0.1281 -0.0462 -0.1072 0.2340 0.3765 -0.0511 -0.0819 -0.2709 0.3665 -0.0852 -0.0952 -0.1360 -0.1443 0.4445 -0.2329 0.0639 0.0756 0.0662 0.0687 0.0749 -0.0303 0.0450 0.0586 0.0872 0.0638 0.0592 0.0590 0.0910 0.0789 0.0581 0.0541 0.0978 0.1090 0.0687 0.0608 0.0740 0.0544 0.0940 0.0854 0.0571 0.1389 0.1383 0.1672 0.1716 0.1037 0.1175 0.1242
va: 2.1303 2.0613 2.0627 2.0370 3.9118 3.9229 3.7880 3.8228 3.8828 3.9468 3.8892 3.8663 3.8660 3.9114 3.7025 3.8834 3.7209 3.9023 3.6426 3.6344 3.9306 4.0489 3.9233 3.8694 3.8791 3.8729 3.9937 3.9251 1.0174 1.0153 1.0084 1.0125 1.0151 1.0719 1.0121 1.0140 1.0079 1.0152 1.0114 1.0082 1.0084 1.0181 1.0064 1.0073 1.0192 1.0145 1.0114 1.0077 1.0067 1.0095 1.0038 1.0053 0.9994 1.0204 1.0223 0.9887 0.9830 1.0124 1.0038 1.0002
dispcorr: -0.035941402 hartree
energy: -1234.917579387633
dipole: -21.09193 21.24752 0.15559 -0.14519 0.36455 0.21935 30.32808 -30.57707 -0.24899
magnitude: 0.36650 au
magnitude: 0.93156 debye
