program: Orca
programVersion: 5.0.2
elementType: O O O O C C C C C C C C C C C C C C C C C C C C C C C C H H H H H H H H H H H H H H H H H H H H H H H H H H H H H H H H
charge: 0
multiplicity: 1
keywords: wb97x-d3
keywords: def2-TZVPP
keywords: def2/J RIJCOSX
keywords: DEFGRID2
keywords: scfconv7
keywords: smallprint printgap noloewdin
keywords: NOSOSCF
formula: C24H32O4
InChI: InChI=1/C24H32O4/c1-3-4-5-6-7-8-9-10-11-12-17-21-22(26)19-15-13-14-16-20(19)23(27)24(21)28-18(2)25/h13-16H,3-12,17H2,1-2H3
60 atoms
O  3.035888 0.700236 -1.055688
O  0.272049 -3.066124 -0.624469
O  0.891333 2.067112 -1.802859
O  3.200031 0.612831 -3.282784
C  1.036542 -0.316093 2.650636
C  0.317433 1.024717 2.738221
C  2.522994 -0.158715 2.360343
C  -1.168827 0.927805 3.072432
C  3.297895 -1.469542 2.253199
C  -1.970032 0.147409 2.035047
C  2.797886 -2.495408 1.238234
C  -3.485572 0.258138 2.174011
C  2.860073 -2.074254 -0.241346
C  -4.032915 1.630616 1.79778
C  1.720543 -1.226161 -0.711958
C  -5.556753 1.71408 1.790099
C  1.83555 0.047863 -1.106874
C  0.38134 -1.870043 -0.806647
C  -0.798522 -1.043854 -1.149503
C  -0.644713 0.297805 -1.502752
C  -6.213488 0.868393 0.706917
C  0.696956 0.90452 -1.511251
C  -2.068506 -1.60502 -1.11034
C  -1.757267 1.067887 -1.817454
C  -3.177632 -0.829531 -1.413662
C  -3.022422 0.503034 -1.770923
C  3.624633 1.019387 -2.236598
C  4.805617 1.900159 -2.02715
H  0.569163 -0.927362 1.874129
H  0.902001 -0.868774 3.587524
H  0.432374 1.551474 1.783163
H  0.814951 1.648494 3.487651
H  2.976872 0.437171 3.158627
H  2.654814 0.433603 1.452775
H  -1.297089 0.463497 4.056152
H  -1.567653 1.942065 3.163695
H  4.345734 -1.241632 2.036029
H  3.295528 -1.955265 3.233995
H  -1.688511 0.49474 1.035879
H  -1.685385 -0.907306 2.074736
H  1.790917 -2.824302 1.499882
H  3.426552 -3.383038 1.335829
H  -3.786974 0.011698 3.19838
H  -3.943905 -0.501877 1.534924
H  2.866821 -2.978537 -0.854195
H  3.808436 -1.57241 -0.433457
H  -3.640552 2.384474 2.485892
H  -3.657116 1.904582 0.804937
H  -5.852264 2.757335 1.650537
H  -5.94389 1.420604 2.770875
H  -5.833157 1.132319 -0.282652
H  -6.038795 -0.198391 0.851782
H  -7.293968 1.018309 0.691397
H  -2.197565 -2.641645 -0.830615
H  -1.639448 2.107167 -2.092534
H  -4.166277 -1.26648 -1.371097
H  -3.88914 1.104243 -2.009994
H  5.440796 1.524397 -1.22619
H  4.463591 2.894317 -1.733915
H  5.382705 1.984579 -2.943042
elementType: O C H
totalener: -1234.87920340 hartree
nucrepener: 2803.65988949 hartree
electener: -4038.53909289 hartree
oneelecener: -7252.99110886 hartree
twoeener: 3214.45201597 hartree
cpcmener: -0.03397715 hartree
kineticenergy: 1229.30492302 hartree
xcener: -121.331711652793 hartree
chargesum: -0.0000000
charge: -0.301354 -0.428449 -0.427551 -0.436995 -0.122129 -0.136774 -0.138426 -0.152332 -0.161587 -0.075599 -0.149766 -0.163077 -0.124471 -0.126918 -0.004873 -0.100976 0.180284 0.377846 -0.078853 -0.075310 -0.289825 0.375120 -0.107527 -0.028712 -0.122228 -0.183840 0.420196 -0.230240 0.041145 0.080250 0.062112 0.079184 0.084067 0.070045 0.064509 0.076416 0.072967 0.077218 -0.007585 0.086843 0.082257 0.091142 0.076563 0.082138 0.113914 0.095870 0.080352 0.064029 0.068076 0.053659 0.076777 0.080826 0.097867 0.136961 0.138545 0.168628 0.174941 0.119305 0.123231 0.102112
qa: -0.3014 -0.4284 -0.4276 -0.4370 -0.1221 -0.1368 -0.1384 -0.1523 -0.1616 -0.0756 -0.1498 -0.1631 -0.1245 -0.1269 -0.0049 -0.1010 0.1803 0.3778 -0.0789 -0.0753 -0.2898 0.3751 -0.1075 -0.0287 -0.1222 -0.1838 0.4202 -0.2302 0.0411 0.0803 0.0621 0.0792 0.0841 0.0700 0.0645 0.0764 0.0730 0.0772 -0.0076 0.0868 0.0823 0.0911 0.0766 0.0821 0.1139 0.0959 0.0804 0.0640 0.0681 0.0537 0.0768 0.0808 0.0979 0.1370 0.1385 0.1686 0.1749 0.1193 0.1232 0.1021
va: 2.0851 2.0534 2.0602 2.0572 3.8504 3.8875 3.8452 3.9349 3.9350 3.8750 3.8710 3.8932 3.8002 3.8697 3.6845 3.8861 3.6855 3.8828 3.6495 3.6197 3.9301 4.0101 3.9219 3.8377 3.8544 3.8911 4.0645 3.9099 1.0083 1.0124 1.0113 1.0123 1.0115 1.0168 1.0112 1.0118 1.0099 1.0057 1.0382 0.9982 1.0116 1.0045 1.0110 1.0029 1.0122 1.0215 1.0152 1.0067 1.0061 1.0083 1.0002 0.9976 1.0072 1.0239 1.0208 0.9877 0.9844 1.0028 1.0007 1.0137
dispcorr: -0.037368173 hartree
energy: -1234.916571575588
dipole: -19.63849 19.35134 -0.28715 5.45276 -5.18047 0.27229 32.49350 -31.31386 1.17964
magnitude: 1.24424 au
magnitude: 3.16261 debye
