program: Orca
programVersion: 5.0.2
elementType: O O O O C C C C C C C C C C C C C C C C C C C C C C C C H H H H H H H H H H H H H H H H H H H H H H H H H H H H H H H H
charge: 0
multiplicity: 1
keywords: wb97x-d3
keywords: def2-TZVPP
keywords: def2/J RIJCOSX
keywords: DEFGRID2
keywords: scfconv7
keywords: smallprint printgap noloewdin
keywords: NOSOSCF
formula: C24H32O4
InChI: InChI=1/C24H32O4/c1-3-4-5-6-7-8-9-10-11-12-17-21-22(26)19-15-13-14-16-20(19)23(27)24(21)28-18(2)25/h13-16H,3-12,17H2,1-2H3
60 atoms
O  2.810219 -1.599199 -2.341128
O  1.772974 2.391434 -0.141749
O  0.29347 -1.634499 -3.216362
O  1.869087 -3.179014 -1.068295
C  0.965673 -0.133127 2.723229
C  -0.550627 -0.280516 2.765629
C  1.620191 -1.163305 1.810933
C  -1.227576 0.708813 3.707198
C  3.14371 -1.0678 1.718116
C  -2.748628 0.582671 3.748828
C  3.720446 0.224578 1.141195
C  -3.443851 1.021357 2.464643
C  3.690673 0.346019 -0.390991
C  -4.955627 0.833877 2.509724
C  2.329412 0.283432 -1.0032
C  -5.67639 1.286571 1.242253
C  1.93321 -0.663288 -1.862802
C  1.376269 1.381293 -0.687467
C  -0.049868 1.214266 -1.043923
C  -0.446205 0.171141 -1.883017
C  -5.68554 2.796209 1.04645
C  0.558849 -0.773915 -2.401697
C  -0.99392 2.111373 -0.562006
C  -1.782201 0.031519 -2.237284
C  -2.327685 1.961314 -0.910241
C  -2.721557 0.924784 -1.745414
C  2.657883 -2.88081 -1.923485
C  3.5693 -3.799106 -2.657965
H  1.375091 -0.228652 3.735173
H  1.210568 0.880368 2.390781
H  -0.809559 -1.299984 3.072586
H  -0.942273 -0.16064 1.74998
H  1.163286 -1.101596 0.820796
H  1.37067 -2.162196 2.182704
H  -0.828803 0.56197 4.715768
H  -0.956053 1.731424 3.421505
H  3.549458 -1.194385 2.726568
H  3.523464 -1.916782 1.140582
H  -3.018455 -0.454999 3.975336
H  -3.13563 1.181586 4.579129
H  4.774455 0.284381 1.421037
H  3.248444 1.093189 1.601979
H  -3.049577 0.459081 1.612385
H  -3.197862 2.07111 2.273528
H  4.318496 -0.436987 -0.814289
H  4.15349 1.296258 -0.669937
H  -5.169884 -0.225452 2.682158
H  -5.369615 1.369602 3.371463
H  -6.709427 0.930029 1.271476
H  -5.216529 0.804472 0.373145
H  -6.182951 3.296432 1.879899
H  -4.679481 3.211272 0.971794
H  -6.217147 3.072888 0.134869
H  -0.694932 2.921976 0.08838
H  -2.092185 -0.77288 -2.89036
H  -3.062732 2.656653 -0.528258
H  -3.76306 0.813038 -2.015059
H  3.213068 -3.914774 -3.683171
H  3.587526 -4.775037 -2.182089
H  4.579687 -3.395592 -2.706654
elementType: O C H
totalener: -1234.88020041 hartree
nucrepener: 2758.75361767 hartree
electener: -3993.63381808 hartree
oneelecener: -7163.56598787 hartree
twoeener: 3169.93216979 hartree
cpcmener: -0.03401967 hartree
kineticenergy: 1229.29419543 hartree
xcener: -121.326066848908 hartree
chargesum: -0.0000000
charge: -0.292303 -0.422383 -0.424927 -0.444915 -0.143274 -0.136607 -0.086633 -0.105994 -0.164291 -0.151625 -0.156195 -0.105014 -0.145714 -0.122809 0.052385 -0.107041 0.167916 0.270517 -0.042050 -0.060478 -0.284788 0.406269 -0.115312 -0.079463 -0.174192 -0.123517 0.434016 -0.230415 0.075973 0.061983 0.071703 0.048016 0.016344 0.089148 0.076072 0.061725 0.087151 0.076664 0.060313 0.074980 0.090495 0.085940 0.044496 0.062556 0.097852 0.109940 0.070040 0.060380 0.075656 0.047735 0.088134 0.073956 0.093781 0.138622 0.142154 0.195798 0.167163 0.122857 0.102131 0.119081
qa: -0.2923 -0.4224 -0.4249 -0.4449 -0.1433 -0.1366 -0.0866 -0.1060 -0.1643 -0.1516 -0.1562 -0.1050 -0.1457 -0.1228 0.0524 -0.1070 0.1679 0.2705 -0.0421 -0.0605 -0.2848 0.4063 -0.1153 -0.0795 -0.1742 -0.1235 0.4340 -0.2304 0.0760 0.0620 0.0717 0.0480 0.0163 0.0891 0.0761 0.0617 0.0872 0.0767 0.0603 0.0750 0.0905 0.0859 0.0445 0.0626 0.0979 0.1099 0.0700 0.0604 0.0757 0.0477 0.0881 0.0740 0.0938 0.1386 0.1422 0.1958 0.1672 0.1229 0.1021 0.1191
va: 2.1307 2.0572 2.0608 2.0496 3.8785 3.8735 3.8428 3.8696 3.8984 3.9394 3.8617 3.8612 3.8557 3.8968 3.6049 3.8861 3.7865 3.9870 3.6232 3.6866 3.9194 4.0330 3.8864 3.9362 3.8841 3.9177 4.0242 3.9200 1.0133 1.0106 1.0152 1.0044 1.0391 1.0082 1.0109 1.0118 1.0050 1.0141 1.0093 1.0097 1.0087 1.0152 1.0060 1.0017 1.0206 1.0137 1.0092 1.0095 1.0092 1.0121 1.0026 1.0007 1.0032 1.0258 1.0188 0.9675 0.9892 1.0011 1.0134 1.0026
dispcorr: -0.035679671 hartree
energy: -1234.915880080926
dipole: -23.23195 23.31553 0.08358 5.83308 -5.52135 0.31173 34.67752 -34.78605 -0.10853
magnitude: 0.34050 au
magnitude: 0.86549 debye
