program: Orca
programVersion: 5.0.2
elementType: O O O O C C C C C C C C C C C C C C C C C C C C C C C C H H H H H H H H H H H H H H H H H H H H H H H H H H H H H H H H
charge: 0
multiplicity: 1
keywords: wb97x-d3
keywords: def2-TZVPP
keywords: def2/J RIJCOSX
keywords: DEFGRID2
keywords: scfconv7
keywords: smallprint printgap noloewdin
keywords: NOSOSCF
formula: C24H32O4
InChI: InChI=1/C24H32O4/c1-3-4-5-6-7-8-9-10-11-12-17-21-22(26)19-15-13-14-16-20(19)23(27)24(21)28-18(2)25/h13-16H,3-12,17H2,1-2H3
60 atoms
O  1.924624 -1.93611 -1.864105
O  2.375253 2.557854 -0.691924
O  -0.642733 -1.452291 -2.343855
O  0.913325 -2.97866 -0.16186
C  1.118121 0.249207 3.549002
C  0.419245 -1.106534 3.490004
C  1.843062 0.657781 2.269772
C  -0.631196 -1.23677 2.391184
C  3.012269 -0.25483 1.901277
C  -1.760615 -0.217503 2.466693
C  3.963526 0.329747 0.853748
C  -2.877221 -0.522591 1.476964
C  3.622061 0.025231 -0.614392
C  -3.958062 0.547779 1.429125
C  2.194325 0.24197 -0.999655
C  -5.069282 0.233363 0.436664
C  1.413298 -0.717593 -1.513721
C  1.636563 1.616989 -0.901899
C  0.17999 1.816085 -1.080096
C  -0.620305 0.775933 -1.556165
C  -6.114575 1.334648 0.349949
C  -0.017666 -0.5345 -1.853226
C  -0.390171 3.04918 -0.792372
C  -1.980038 0.977469 -1.755281
C  -1.751702 3.239736 -0.973504
C  -2.544454 2.208385 -1.459081
C  1.534289 -3.043981 -1.18591
C  1.978286 -4.280955 -1.884144
H  1.838266 0.23902 4.373331
H  0.388383 1.023512 3.801719
H  -0.05601 -1.295034 4.457908
H  1.163441 -1.899026 3.366543
H  2.222592 1.675515 2.399004
H  1.118354 0.711026 1.452574
H  -0.15703 -1.156729 1.40941
H  -1.056075 -2.244653 2.435772
H  3.58681 -0.445581 2.812793
H  2.647382 -1.232708 1.570098
H  -2.169636 -0.187428 3.482769
H  -1.36971 0.785639 2.266371
H  4.964811 -0.074829 1.012102
H  4.053297 1.40619 1.007885
H  -3.329057 -1.488369 1.727903
H  -2.445871 -0.644702 0.476959
H  3.891772 -1.008896 -0.821601
H  4.257536 0.641103 -1.256338
H  -4.389924 0.678749 2.427489
H  -3.502263 1.509828 1.169668
H  -5.550336 -0.708072 0.718592
H  -4.633333 0.063994 -0.553149
H  -6.59052 1.506743 1.317438
H  -5.667445 2.279465 0.033762
H  -6.90217 1.088568 -0.363343
H  0.222937 3.858395 -0.419569
H  -2.599613 0.175596 -2.133418
H  -2.194851 4.197442 -0.736459
H  -3.605516 2.361619 -1.603899
H  1.831797 -5.148838 -1.248318
H  3.025382 -4.213405 -2.176617
H  1.391403 -4.408033 -2.795529
elementType: O C H
totalener: -1234.87897116 hartree
nucrepener: 2834.50423099 hartree
electener: -4069.38320215 hartree
oneelecener: -7315.52822143 hartree
twoeener: 3246.14501928 hartree
cpcmener: -0.03340612 hartree
kineticenergy: 1229.31026367 hartree
xcener: -121.330698070305 hartree
chargesum: 0.0000000
charge: -0.291399 -0.420694 -0.428295 -0.443409 -0.174239 -0.166125 -0.043361 -0.038194 -0.136358 -0.153972 -0.152458 -0.120199 -0.163344 -0.138470 0.042036 -0.104180 0.166506 0.258561 0.035350 -0.128594 -0.281622 0.428909 -0.109362 -0.091080 -0.109044 -0.163617 0.439237 -0.230641 0.076876 0.081945 0.075605 0.079625 0.081650 -0.019751 -0.015567 0.082493 0.083176 0.066102 0.072459 0.058859 0.092056 0.079569 0.079521 0.048268 0.097236 0.110240 0.081288 0.058131 0.069782 0.057484 0.083089 0.073455 0.091918 0.141640 0.149003 0.165838 0.172800 0.102523 0.119310 0.121436
qa: -0.2914 -0.4207 -0.4283 -0.4434 -0.1742 -0.1661 -0.0434 -0.0382 -0.1364 -0.1540 -0.1525 -0.1202 -0.1633 -0.1385 0.0420 -0.1042 0.1665 0.2586 0.0353 -0.1286 -0.2816 0.4289 -0.1094 -0.0911 -0.1090 -0.1636 0.4392 -0.2306 0.0769 0.0819 0.0756 0.0796 0.0817 -0.0198 -0.0156 0.0825 0.0832 0.0661 0.0725 0.0589 0.0921 0.0796 0.0795 0.0483 0.0972 0.1102 0.0813 0.0581 0.0698 0.0575 0.0831 0.0735 0.0919 0.1416 0.1490 0.1658 0.1728 0.1025 0.1193 0.1214
va: 2.1296 2.0629 2.0531 2.0584 3.9242 3.9063 3.8124 3.8448 3.8539 3.8809 3.8739 3.8591 3.8694 3.8620 3.5819 3.8621 3.8267 4.0196 3.5737 3.7015 3.9396 3.9586 3.9429 3.8107 3.9134 3.8900 4.0239 3.9157 1.0104 1.0016 1.0102 1.0051 1.0157 1.0460 1.0279 1.0103 1.0085 1.0168 1.0149 1.0026 1.0071 1.0199 1.0128 1.0099 1.0183 1.0117 1.0105 1.0049 1.0098 1.0050 1.0012 1.0017 1.0041 1.0202 1.0214 0.9893 0.9811 1.0136 1.0025 1.0016
dispcorr: -0.037755496 hartree
energy: -1234.916726656221
dipole: -17.99814 18.10238 0.10424 -2.03066 2.34286 0.31220 27.90580 -28.30773 -0.40193
magnitude: 0.51951 au
magnitude: 1.32048 debye
