program: Orca
programVersion: 5.0.2
elementType: O O O O C C C C C C C C C C C C C C C C C C C C C C C C H H H H H H H H H H H H H H H H H H H H H H H H H H H H H H H H
charge: 0
multiplicity: 1
keywords: wb97x-d3
keywords: def2-TZVPP
keywords: def2/J RIJCOSX
keywords: DEFGRID2
keywords: scfconv7
keywords: smallprint printgap noloewdin
keywords: NOSOSCF
formula: C24H32O4
InChI: InChI=1/C24H32O4/c1-3-4-5-6-7-8-9-10-11-12-17-21-22(26)19-15-13-14-16-20(19)23(27)24(21)28-18(2)25/h13-16H,3-12,17H2,1-2H3
60 atoms
O  2.108855 -1.909341 -1.764668
O  2.16942 2.612291 -0.574025
O  -0.452764 -1.577628 -2.475504
O  0.88536 -3.011458 -0.24774
C  1.490048 -0.937157 2.808156
C  0.039648 -1.024751 3.268241
C  1.912732 0.442472 2.322881
C  -0.995662 -0.678227 2.200973
C  3.395782 0.534329 1.964728
C  -2.397553 -1.103819 2.621993
C  3.880239 -0.350002 0.814898
C  -3.509008 -0.724371 1.650029
C  3.632022 0.185603 -0.603643
C  -3.811075 0.76819 1.593789
C  2.191933 0.302959 -0.9937
C  -5.036407 1.088512 0.748043
C  1.488566 -0.723056 -1.491042
C  1.526051 1.630316 -0.886621
C  0.074767 1.730208 -1.165815
C  -0.63087 0.629217 -1.655185
C  -5.362091 2.573217 0.705829
C  0.074301 -0.636568 -1.918949
C  -0.586385 2.934021 -0.957388
C  -1.987897 0.73613 -1.932414
C  -1.940992 3.036192 -1.233895
C  -2.640093 1.940476 -1.722073
C  1.683075 -3.037386 -1.144447
C  2.322851 -4.246494 -1.730856
H  1.649469 -1.674018 2.016844
H  2.142991 -1.237315 3.634256
H  -0.111483 -0.375659 4.13727
H  -0.147197 -2.044531 3.619921
H  1.703448 1.175231 3.10902
H  1.28538 0.737296 1.478507
H  -0.971592 0.395253 1.991757
H  -0.73648 -1.175937 1.25926
H  3.657859 1.574605 1.749959
H  3.968028 0.266257 2.858181
H  -2.398459 -2.189742 2.757945
H  -2.624659 -0.679178 3.6066
H  3.469728 -1.358559 0.903479
H  4.962804 -0.464571 0.903749
H  -4.422791 -1.252238 1.941385
H  -3.260515 -1.086841 0.645835
H  4.136429 -0.477172 -1.307657
H  4.111936 1.159019 -0.702322
H  -3.971399 1.140644 2.611968
H  -2.946872 1.316075 1.203629
H  -5.897032 0.53887 1.142033
H  -4.882871 0.715363 -0.269437
H  -6.23821 2.774884 0.087847
H  -5.569611 2.960575 1.705245
H  -4.532088 3.153759 0.298329
H  -0.046313 3.792409 -0.582054
H  -2.534463 -0.116339 -2.312672
H  -2.452718 3.974896 -1.07024
H  -3.696317 2.024645 -1.93817
H  2.24934 -5.083911 -1.042948
H  3.365526 -4.068111 -1.98648
H  1.797194 -4.508779 -2.651596
elementType: O C H
totalener: -1234.88037435 hartree
nucrepener: 2822.89879700 hartree
electener: -4057.77917135 hartree
oneelecener: -7292.31949484 hartree
twoeener: 3234.54032349 hartree
cpcmener: -0.03269453 hartree
kineticenergy: 1229.30360410 hartree
xcener: -121.328604241123 hartree
chargesum: -0.0000000
charge: -0.288644 -0.425656 -0.424432 -0.446324 -0.148571 -0.158147 -0.051878 -0.080495 -0.188903 -0.142344 -0.144509 -0.122438 -0.136462 -0.121224 -0.042505 -0.101995 0.177888 0.414398 -0.068666 -0.083668 -0.285207 0.380991 -0.083804 -0.102352 -0.122980 -0.146631 0.442145 -0.230046 0.056469 0.078007 0.067398 0.068972 0.082650 0.015993 0.068192 0.028540 0.080513 0.084988 0.072257 0.063779 0.081892 0.091002 0.077843 0.059847 0.102368 0.098789 0.074060 0.037933 0.072143 0.056400 0.093632 0.086589 0.071278 0.139973 0.140063 0.166190 0.170535 0.104744 0.115967 0.123456
qa: -0.2886 -0.4257 -0.4244 -0.4463 -0.1486 -0.1581 -0.0519 -0.0805 -0.1889 -0.1423 -0.1445 -0.1224 -0.1365 -0.1212 -0.0425 -0.1020 0.1779 0.4144 -0.0687 -0.0837 -0.2852 0.3810 -0.0838 -0.1024 -0.1230 -0.1466 0.4421 -0.2300 0.0565 0.0780 0.0674 0.0690 0.0826 0.0160 0.0682 0.0285 0.0805 0.0850 0.0723 0.0638 0.0819 0.0910 0.0778 0.0598 0.1024 0.0988 0.0741 0.0379 0.0721 0.0564 0.0936 0.0866 0.0713 0.1400 0.1401 0.1662 0.1705 0.1047 0.1160 0.1235
va: 2.1285 2.0531 2.0611 2.0512 3.8803 3.9211 3.8334 3.8417 3.9271 3.9363 3.8749 3.8796 3.8380 3.8414 3.7120 3.8555 3.8022 3.8709 3.6796 3.6304 3.9354 3.9915 3.9331 3.8545 3.8945 3.8897 4.0101 3.9212 1.0251 1.0159 1.0096 1.0096 1.0115 1.0333 1.0003 1.0296 1.0130 1.0065 1.0105 1.0083 1.0105 1.0076 1.0095 1.0108 1.0150 1.0255 1.0129 1.0092 1.0095 1.0047 1.0035 1.0028 1.0024 1.0224 1.0232 0.9904 0.9807 1.0122 1.0048 1.0002
dispcorr: -0.037108211 hartree
energy: -1234.917482565348
dipole: -17.22991 17.45314 0.22323 -0.03748 0.30589 0.26841 28.80146 -29.20192 -0.40046
magnitude: 0.53126 au
magnitude: 1.35037 debye
