program: Orca
programVersion: 5.0.2
elementType: O O O O C C C C C C C C C C C C C C C C C C C C C C C C H H H H H H H H H H H H H H H H H H H H H H H H H H H H H H H H
charge: 0
multiplicity: 1
keywords: wb97x-d3
keywords: def2-TZVPP
keywords: def2/J RIJCOSX
keywords: DEFGRID2
keywords: scfconv7
keywords: smallprint printgap noloewdin
keywords: NOSOSCF
formula: C24H32O4
InChI: InChI=1/C24H32O4/c1-3-4-5-6-7-8-9-10-11-12-17-21-22(26)19-15-13-14-16-20(19)23(27)24(21)28-18(2)25/h13-16H,3-12,17H2,1-2H3
60 atoms
O  1.829133 -1.709932 -1.950996
O  2.213943 2.606522 -0.18322
O  -0.511143 -0.955744 -2.987742
O  0.288419 -2.770427 -0.720248
C  1.398071 -0.391558 3.889655
C  -0.05286 -0.33671 3.392716
C  2.266151 -1.459551 3.221497
C  -0.31251 0.694148 2.296873
C  2.433145 -1.336305 1.709985
C  -1.75965 0.740535 1.816144
C  3.238845 -0.117116 1.283355
C  -2.203534 -0.522777 1.085157
C  3.351532 0.047964 -0.239716
C  -3.565036 -0.398433 0.407466
C  2.0411 0.375017 -0.881574
C  -4.730942 -0.098331 1.346255
C  1.326121 -0.482423 -1.62144
C  1.517812 1.757021 -0.702323
C  0.148162 2.075467 -1.165405
C  -0.579351 1.146563 -1.911383
C  -4.938418 -1.154667 2.422089
C  0.019813 -0.157956 -2.242883
C  -0.414379 3.308314 -0.860974
C  -1.860332 1.45461 -2.350738
C  -1.698472 3.607158 -1.291409
C  -2.419934 2.683213 -2.0346
C  1.188799 -2.822143 -1.512492
C  1.751322 -4.047425 -2.142307
H  1.399888 -0.600456 4.962383
H  1.860187 0.595457 3.7866
H  -0.713552 -0.102053 4.233025
H  -0.352496 -1.333432 3.052794
H  1.831738 -2.439221 3.443112
H  3.254984 -1.457829 3.691741
H  -0.026365 1.681262 2.673625
H  0.336164 0.501962 1.437917
H  2.931228 -2.235187 1.332898
H  1.447521 -1.323756 1.23889
H  -2.416751 0.930907 2.671433
H  -1.882337 1.597656 1.145004
H  4.253804 -0.20377 1.680095
H  2.820746 0.790719 1.723107
H  -2.211657 -1.372725 1.773396
H  -1.455478 -0.770088 0.324828
H  3.766562 -0.862995 -0.670207
H  4.059984 0.848021 -0.46163
H  -3.51273 0.388806 -0.351107
H  -3.777374 -1.326101 -0.133902
H  -5.642722 -0.010326 0.749469
H  -4.590209 0.878591 1.816855
H  -5.828988 -0.9446 3.016049
H  -5.06379 -2.146845 1.983092
H  -4.094894 -1.206033 3.112473
H  0.141289 4.033381 -0.28213
H  -2.424962 0.737624 -2.931127
H  -2.136984 4.564654 -1.045191
H  -3.421309 2.918671 -2.368334
H  1.419242 -4.932874 -1.608391
H  2.839381 -4.01862 -2.166951
H  1.401004 -4.110262 -3.174503
elementType: O C H
totalener: -1234.87930678 hartree
nucrepener: 2853.77843478 hartree
electener: -4088.65774156 hartree
oneelecener: -7354.12551337 hartree
twoeener: 3265.46777181 hartree
cpcmener: -0.03329305 hartree
kineticenergy: 1229.28991186 hartree
xcener: -121.330211258785 hartree
chargesum: -0.0000000
charge: -0.287280 -0.429099 -0.422146 -0.445208 -0.161081 -0.140527 -0.164393 -0.028764 -0.066936 -0.153097 -0.168518 -0.080439 -0.129563 -0.170443 -0.016092 -0.105347 0.214220 0.381563 -0.078914 -0.055720 -0.283330 0.371783 -0.114164 -0.138389 -0.108420 -0.116802 0.440817 -0.234183 0.084151 0.066703 0.076944 0.070390 0.074607 0.070538 0.084813 -0.064477 0.087578 0.022647 0.083122 0.063062 0.084318 0.078100 0.088567 0.021761 0.096302 0.108202 0.067061 0.080173 0.070330 0.060921 0.093139 0.082652 0.078898 0.137905 0.144371 0.165468 0.166900 0.103746 0.117767 0.123813
qa: -0.2873 -0.4291 -0.4221 -0.4452 -0.1611 -0.1405 -0.1644 -0.0288 -0.0669 -0.1531 -0.1685 -0.0804 -0.1296 -0.1704 -0.0161 -0.1053 0.2142 0.3816 -0.0789 -0.0557 -0.2833 0.3718 -0.1142 -0.1384 -0.1084 -0.1168 0.4408 -0.2342 0.0842 0.0667 0.0769 0.0704 0.0746 0.0705 0.0848 -0.0645 0.0876 0.0226 0.0831 0.0631 0.0843 0.0781 0.0886 0.0218 0.0963 0.1082 0.0671 0.0802 0.0703 0.0609 0.0931 0.0827 0.0789 0.1379 0.1444 0.1655 0.1669 0.1037 0.1178 0.1238
va: 2.1276 2.0544 2.0606 2.0509 3.8886 3.8813 3.9434 3.8698 3.8154 3.9050 3.8898 3.8505 3.8562 3.9071 3.6536 3.8743 3.7415 3.9013 3.6762 3.5831 3.9305 4.0058 3.9243 3.8825 3.9052 3.8896 4.0127 3.9253 1.0053 1.0045 1.0068 1.0044 1.0077 1.0101 1.0107 1.0530 1.0077 1.0148 1.0085 1.0166 1.0154 1.0136 1.0022 1.0253 1.0224 1.0174 1.0194 1.0079 1.0084 1.0041 1.0054 1.0003 0.9971 1.0238 1.0207 0.9885 0.9885 1.0127 1.0035 1.0003
dispcorr: -0.038667672 hartree
energy: -1234.917974452141
dipole: -14.67095 14.91062 0.23967 -10.18125 10.49860 0.31735 33.32811 -33.60470 -0.27659
magnitude: 0.48441 au
magnitude: 1.23127 debye
