program: Gaussian 09
title: 000054981
version: EM64L-G09RevD.01
frameworkgroup: C1[X(C16H26N2O4)]
method: RPBEPBE
basis: SDD
operation: Freq
keyword: #p
keyword: freq=noraman
keyword: PBEPBE/SDD
title: #p freq=noraman PBEPBE/SDD
converged: YES YES NO NO
title: Mulliken charges:
elementType: O O O O N N C C C C C C C C C C C C C C C C H H H H H H H H H H H H H H H H H H H H H H H H H H
charge: -0.449115 -0.318442 -0.314975 -0.277604 -0.343134 -0.460099 0.272284 -0.422346 -0.138860 -0.724978 -0.684491 -0.694931 -0.311595 0.385093 -0.328067 -0.372817 0.478939 -0.363680 -0.432628 0.258984 -0.213593 -0.673861 0.240991 0.230539 0.222330 0.212003 0.210200 0.231767 0.201445 0.227301 0.210140 0.205240 0.226336 0.205306 0.210490 0.238105 0.229115 0.352081 0.252012 0.247386 0.298834 0.224541 0.327144 0.228984 0.227104 0.212579 0.228833 0.229112
chargesum: 0.00000
title: Mulliken charges with hydrogens summed into heavy atoms:
elementType: O O O O N N C C C C C C C C C C C C C C C C
charge: -0.097034 -0.318442 -0.314975 -0.277604 -0.102143 -0.132954 0.272284 0.030522 0.073142 -0.081566 -0.041810 -0.052798 0.155624 0.385093 -0.076055 -0.125431 0.478939 -0.064845 -0.208088 0.258984 0.242495 -0.003337
polarizability: 3.04619582e+02 -2.48114661e+01 1.59693145e+02 -4.49008357e+00 -1.07892287e+01 1.80870878e+02
1716.lowfreq: -9.9104 -0.0009 -0.0005 0.0009 1.4474 6.3890 9.4306 19.6737 21.1129
frequency: 8.6566 19.6318 21.1047 27.9373 44.6112 60.4743 61.9258 70.6544 95.7478 112.0699 113.5529 132.4466 148.9579 166.6720 193.1939 204.6642 236.5443 247.1056 251.8664 252.9181 258.0585 275.8737 298.9470 330.6579 332.2496 365.0014 369.9339 382.6573 401.5497 414.6730 430.2470 438.2040 451.2321 469.2167 492.5596 518.9222 530.6214 625.5707 629.0410 633.5329 665.8964 695.9185 707.8093 713.5072 740.2735 779.4519 801.0398 811.7219 822.6153 831.9477 847.7480 873.1918 885.4134 902.7551 918.1506 922.7950 936.3272 937.3028 951.1522 966.0649 978.1790 996.4687 1000.9432 1016.7085 1027.1146 1045.4436 1078.2865 1102.0031 1111.8520 1115.6739 1122.1691 1140.0552 1162.3497 1175.5000 1182.8819 1209.1328 1216.1514 1225.6586 1240.2617 1245.3777 1251.0541 1261.9529 1273.4518 1308.5302 1327.1207 1348.4165 1355.7160 1358.4340 1365.0352 1372.4841 1377.7733 1380.7287 1393.7612 1400.5041 1422.5212 1447.4303 1453.7710 1456.2170 1461.7780 1463.7017 1464.3893 1475.9199 1476.8539 1484.6187 1487.1771 1489.1950 1495.4350 1499.9454 1518.2331 1596.2916 1632.5166 1660.9523 2931.1590 2966.9583 2971.3137 2980.4293 2983.6145 2995.3030 3007.2615 3028.1641 3055.4323 3059.3950 3061.2590 3065.2155 3067.7135 3068.3396 3077.7377 3086.5997 3092.5044 3093.1058 3105.9963 3119.5449 3161.3685 3165.1284 3188.0859 3411.4173 3526.2715 3546.0555
redmass: 4.1813 3.9251 3.0534 3.0347 3.1665 4.2210 4.1929 5.1201 3.2328 3.8963 4.1456 4.2437 4.6724 1.3134 4.8300 1.9304 2.4585 1.8436 1.1837 1.1855 1.4437 4.7114 3.0660 2.6783 4.7824 2.9617 3.9965 3.6431 2.3275 2.9282 2.5787 2.0825 1.5026 2.6889 2.9682 2.4120 4.3792 4.1727 5.8731 1.2629 1.6332 6.2926 6.7826 3.7930 3.1794 4.3024 1.0950 1.3082 4.6814 1.6223 3.0533 4.2423 1.9861 1.8481 1.9253 1.9347 1.3580 1.2291 3.4266 1.3411 4.2877 1.7771 2.5743 1.4118 1.5403 3.4811 2.0644 3.4928 2.2180 1.9283 1.3059 1.4679 2.9520 1.2533 1.2935 2.3323 2.2751 1.5980 2.5268 1.3783 1.1285 2.3534 2.2008 1.4011 1.3224 1.3571 1.4627 1.3158 1.2183 1.2683 1.4430 3.1141 1.2097 1.2777 3.8469 1.1148 1.0952 1.1075 1.0498 1.0405 1.0507 1.0622 1.0591 1.0750 1.1208 1.1103 1.0770 2.0059 2.5030 5.5590 6.4851 8.5941 1.0690 1.0351 1.0367 1.0554 1.0357 1.0357 1.0580 1.0852 1.1071 1.0935 1.0984 1.1069 1.0983 1.0992 1.0980 1.1005 1.0986 1.0996 1.1026 1.0898 1.0894 1.0947 1.0953 1.0737 1.0651 1.0761
irintensity: 0.1217 0.9027 0.0825 0.0859 0.2518 0.1403 0.1711 5.1487 0.6514 1.2696 3.1408 2.0637 7.5103 4.8000 1.1177 7.8782 2.4591 1.1044 0.8628 0.1005 1.3860 3.7609 1.6441 1.9442 12.6824 3.0471 2.0995 1.0007 1.3729 0.9574 39.2681 37.8419 125.2135 2.2426 11.2242 29.7251 35.3758 8.2555 9.0635 49.2495 70.8738 41.1936 19.2490 0.5202 1.5637 17.6223 3.7177 17.3365 2.3967 83.5740 25.3786 3.1538 2.7296 3.6100 25.2281 29.8921 0.7588 0.1858 93.9798 1.5667 89.6670 25.9375 2.0861 5.2242 41.7763 248.6454 27.4374 32.3158 18.7481 11.9084 24.9396 5.0678 618.7655 50.4592 2.5210 160.7620 126.9302 52.9524 44.5544 13.0735 0.0373 22.9565 8.3744 16.0266 4.3251 6.6656 36.7927 4.9717 19.4147 26.0776 31.5978 73.9396 17.3478 29.1287 50.3019 18.5808 7.3144 73.9537 2.0860 11.9426 2.1603 7.5578 21.8382 7.2479 7.0967 26.3695 28.6237 21.9486 762.3049 19.1227 3.1460 256.9103 64.7911 32.9914 42.5599 23.2217 11.9813 24.2968 26.4193 28.2360 18.8892 22.3406 4.5789 9.4486 62.8242 26.3172 63.8749 5.4199 33.3769 73.9043 46.9626 20.1718 9.7135 6.4831 5.9589 2.6868 17.2003 30.5214
temp: 298.150 k
press: 1.00000 atm
elementType: 8 8 8 8 7 7 6 6 6 6 6 6 6 6 6 6 6 6 6 6 6 6 1 1 1 1 1 1 1 1 1 1 1 1 1 1 1 1 1 1 1 1 1 1 1 1 1 1
symmnumber: 1
zpe: 1057499.2 jmol-1
zpe.correction: 0.402780 hartree
zpe.thermalcorrener: 0.427698 hartree
zpe.thermalcorrenthalpy: 0.428642 hartree
zpe.thermalcorrgfe: 0.344126 hartree
zpe.sumelectzpe: -1033.975361 hartree
zpe.sumelectthermal: -1033.950444 hartree
zpe.sumelectthermalent: -1033.949500 hartree
zpe.sumelectthermalfe: -1034.034016 hartree
dipole: -1.0741 1.9058 1.6442
dipole: 2.7366
quadrupole: -107.9697 -142.6125 -127.5219
quadrupole: 9.0363 -9.8405 -1.5980
quadrupole: 18.0650 -16.5778 -1.4872 9.0363 -9.8405 -1.5980
hfenergy: -1034.3781416 hartree
pointgroup: C01 [X(C16H26N2O4)]
dipole: -0.4471411 0.8353059 0.5114304 debye
polarizability: 306.6539676|-17.8821617|154.318606|-3.8165434|-5.4932498|184.2110316 unknown
InChI: InChI=1S/C16H26N2O4/c1-5-21-15(20)18-12-6-8-14(9-7-12)22-11-13(19)10-17-16(2,3)4/h6-9,13,17-19H,5,10-11H2,1-4H3
charge 0 multiplicity 1
48 atoms
O  3.890884 -2.797508 0.298748
O  1.642154 -1.20404 0.409977
O  -6.091709 0.303766 0.487388
O  -4.688953 0.164047 -1.404538
N  4.638492 0.707974 -0.873572
N  -3.901924 -0.136817 0.814584
C  4.841471 2.105024 -0.363423
C  4.506229 -0.394395 0.104496
C  3.796473 -1.603997 -0.554281
C  5.081215 2.990464 -1.610984
C  3.555924 2.581559 0.35815
C  6.062348 2.216218 0.59837
C  2.332797 -1.298789 -0.895534
C  0.262508 -0.934211 0.412882
C  -0.514799 -0.718102 -0.749477
C  -0.351134 -0.880366 1.688028
C  -2.514265 -0.397496 0.630486
C  -1.897404 -0.450901 -0.644048
C  -1.72614 -0.614521 1.793941
C  -4.85286 0.111239 -0.158997
C  -7.239533 0.588911 -0.418355
C  -8.476029 0.709843 0.466739
H  5.354958 0.485386 -1.580764
H  5.472153 -0.761964 0.516867
H  3.892121 -0.05045 0.955325
H  4.32617 -1.877447 -1.485971
H  5.22244 4.046585 -1.320089
H  4.219721 2.925698 -2.299096
H  5.988177 2.667799 -2.1597
H  2.682829 2.472002 -0.308865
H  3.358145 2.004221 1.279502
H  3.651746 3.644288 0.646277
H  5.929311 1.568554 1.484422
H  6.994913 1.911301 0.086026
H  6.191549 3.255005 0.955635
H  2.270479 -0.336578 -1.438397
H  1.883615 -2.120143 -1.486933
H  3.197463 -2.699068 1.003399
H  -0.06104 -0.753261 -1.743895
H  0.259817 -1.04788 2.580136
H  -2.498656 -0.2839 -1.540152
H  -2.191418 -0.575194 2.786891
H  -4.256375 -0.132128 1.773231
H  -7.323511 -0.235022 -1.150049
H  -7.025901 1.520925 -0.972774
H  -9.362234 0.923986 -0.158033
H  -8.360599 1.528637 1.197525
H  -8.658818 -0.227952 1.018805
