program: Orca
programVersion: 5.0.2
elementType: O O O O C C C C C C C C C C C C C C C C C C C C C C C C H H H H H H H H H H H H H H H H H H H H H H H H H H H H H H H H
charge: 0
multiplicity: 1
keywords: wb97x-d3
keywords: def2-TZVPP
keywords: def2/J RIJCOSX
keywords: DEFGRID2
keywords: scfconv7
keywords: smallprint printgap noloewdin
keywords: NOSOSCF
formula: C24H32O4
InChI: InChI=1/C24H32O4/c1-3-4-5-6-7-8-9-10-11-12-17-21-22(26)19-15-13-14-16-20(19)23(27)24(21)28-18(2)25/h13-16H,3-12,17H2,1-2H3
60 atoms
O  1.335474 -1.849527 -1.824128
O  2.793882 2.401521 -0.573725
O  -0.957628 -0.68751 -2.541767
O  -0.196279 -2.574407 -0.3611
C  1.477918 0.431771 2.77605
C  0.02595 0.524587 3.23907
C  1.839607 -0.930088 2.193441
C  -1.000617 0.48262 2.112341
C  3.320376 -1.115265 1.877543
C  -2.434406 0.489476 2.627953
C  3.930309 -0.154448 0.862384
C  -3.495426 0.54959 1.531839
C  3.46032 -0.327778 -0.590911
C  -3.501717 -0.627745 0.55995
C  2.097163 0.191208 -0.928581
C  -3.789448 -1.974875 1.211693
C  1.121641 -0.544109 -1.479432
C  1.860876 1.653202 -0.785749
C  0.481346 2.172937 -0.916423
C  -0.517938 1.370984 -1.468638
C  -3.910239 -3.103651 0.19841
C  -0.195104 -0.001302 -1.892585
C  0.182923 3.464493 -0.504785
C  -1.807618 1.864158 -1.613708
C  -1.112713 3.944842 -0.627243
C  -2.104784 3.148365 -1.182881
C  0.548315 -2.807485 -1.274184
C  0.738834 -4.117101 -1.952972
H  2.136522 0.637111 3.626318
H  1.674821 1.225882 2.048882
H  -0.113281 1.451551 3.803869
H  -0.176054 -0.28981 3.94422
H  1.243117 -1.125164 1.30317
H  1.550044 -1.701768 2.91413
H  -0.84742 1.346398 1.455856
H  -0.836774 -0.402291 1.491471
H  3.887967 -1.0178 2.808369
H  3.484245 -2.141275 1.533423
H  -2.595776 -0.390861 3.258429
H  -2.569509 1.353107 3.287104
H  5.008893 -0.325443 0.851117
H  3.804101 0.877218 1.191922
H  -3.363565 1.476779 0.965046
H  -4.483025 0.622577 1.99855
H  3.531887 -1.381772 -0.858173
H  4.168054 0.195548 -1.240371
H  -4.260362 -0.438798 -0.206503
H  -2.550058 -0.684718 0.022685
H  -4.71569 -1.903056 1.791077
H  -3.002467 -2.219685 1.930574
H  -2.981407 -3.237411 -0.359583
H  -4.140497 -4.054354 0.681497
H  -4.701686 -2.902691 -0.526531
H  0.952059 4.092935 -0.076456
H  -2.583821 1.247146 -2.046045
H  -1.347552 4.945412 -0.290261
H  -3.113212 3.526917 -1.279804
H  1.787981 -4.304432 -2.175866
H  0.197717 -4.103372 -2.901859
H  0.342304 -4.921479 -1.340312
elementType: O C H
totalener: -1234.87978737 hartree
nucrepener: 2877.56697955 hartree
electener: -4112.44676692 hartree
oneelecener: -7401.91831939 hartree
twoeener: 3289.47155247 hartree
cpcmener: -0.03234082 hartree
kineticenergy: 1229.29820753 hartree
xcener: -121.330538131459 hartree
chargesum: -0.0000000
charge: -0.291643 -0.426021 -0.420201 -0.449850 -0.141674 -0.155011 -0.041601 -0.043735 -0.162405 -0.159347 -0.154643 -0.154358 -0.115197 -0.080709 -0.053724 -0.102325 0.249014 0.299095 -0.050068 -0.005257 -0.275788 0.324538 -0.092710 -0.133653 -0.111230 -0.135811 0.463972 -0.238589 0.083993 0.059341 0.073118 0.062129 -0.010708 0.081383 0.023631 0.037599 0.077377 0.070822 0.071661 0.073565 0.090504 0.084661 0.073813 0.085331 0.094663 0.114597 0.082027 -0.002027 0.062789 0.061719 0.068402 0.090720 0.079123 0.141253 0.144241 0.165885 0.167857 0.119972 0.124435 0.105053
qa: -0.2916 -0.4260 -0.4202 -0.4499 -0.1417 -0.1550 -0.0416 -0.0437 -0.1624 -0.1593 -0.1546 -0.1544 -0.1152 -0.0807 -0.0537 -0.1023 0.2490 0.2991 -0.0501 -0.0053 -0.2758 0.3245 -0.0927 -0.1337 -0.1112 -0.1358 0.4640 -0.2386 0.0840 0.0593 0.0731 0.0621 -0.0107 0.0814 0.0236 0.0376 0.0774 0.0708 0.0717 0.0736 0.0905 0.0847 0.0738 0.0853 0.0947 0.1146 0.0820 -0.0020 0.0628 0.0617 0.0684 0.0907 0.0791 0.1413 0.1442 0.1659 0.1679 0.1200 0.1244 0.1051
va: 2.1347 2.0537 2.0595 2.0417 3.8889 3.9466 3.8390 3.8383 3.9364 3.9157 3.8843 3.8987 3.8267 3.8511 3.6691 3.8707 3.6986 3.9654 3.6268 3.5494 3.9430 4.0361 3.9118 3.8820 3.9189 3.8977 3.9725 3.9260 1.0108 1.0120 1.0091 1.0092 1.0334 1.0124 1.0311 1.0041 1.0061 1.0104 1.0014 1.0112 1.0068 1.0146 1.0123 1.0086 1.0231 1.0099 1.0100 1.0120 1.0092 1.0026 1.0114 1.0049 1.0019 1.0189 1.0160 0.9879 0.9890 1.0045 1.0000 1.0115
dispcorr: -0.039052329 hartree
energy: -1234.918839694063
dipole: -13.62054 13.88708 0.26654 -13.45697 13.66386 0.20689 26.54564 -26.65576 -0.11012
magnitude: 0.35493 au
magnitude: 0.90216 debye
