program: Orca
programVersion: 5.0.2
elementType: O O O O C C C C C C C C C C C C C C C C C C C C C C C C H H H H H H H H H H H H H H H H H H H H H H H H H H H H H H H H
charge: 0
multiplicity: 1
keywords: wb97x-d3
keywords: def2-TZVPP
keywords: def2/J RIJCOSX
keywords: DEFGRID2
keywords: scfconv7
keywords: smallprint printgap noloewdin
keywords: NOSOSCF
formula: C24H32O4
InChI: InChI=1/C24H32O4/c1-3-4-5-6-7-8-9-10-11-12-17-21-22(26)19-15-13-14-16-20(19)23(27)24(21)28-18(2)25/h13-16H,3-12,17H2,1-2H3
60 atoms
O  1.501357 -1.893124 -1.824425
O  2.667828 2.531191 -0.828041
O  -0.988898 -1.045742 -2.178021
O  0.468786 -2.600917 0.02824
C  1.309121 -0.719376 3.258741
C  0.230361 0.082987 3.982111
C  2.04828 0.049875 2.170733
C  -0.887943 0.634765 3.101298
C  3.233511 -0.731938 1.611792
C  -1.616151 -0.425715 2.285303
C  4.06267 0.01328 0.566631
C  -2.911993 0.0785 1.666357
C  3.579492 -0.12605 -0.885619
C  -3.566952 -0.943553 0.746985
C  2.157488 0.264493 -1.128107
C  -4.85856 -0.454938 0.107213
C  1.206413 -0.591568 -1.522182
C  1.795985 1.701311 -0.989923
C  0.369233 2.093052 -1.054691
C  -0.599481 1.165485 -1.443575
C  -5.459797 -1.473409 -0.849769
C  -0.20685 -0.218139 -1.755711
C  -0.006511 3.395354 -0.752659
C  -1.930953 1.546704 -1.542036
C  -1.340437 3.766764 -0.834634
C  -2.30017 2.846398 -1.232659
C  1.000497 -2.859975 -1.01695
C  1.194698 -4.213008 -1.604258
H  0.875202 -1.627055 2.827837
H  2.035369 -1.06379 4.00185
H  0.703477 0.913137 4.516202
H  -0.215707 -0.553772 4.752789
H  2.413187 0.998937 2.57977
H  1.347355 0.31423 1.373761
H  -1.608296 1.148038 3.746636
H  -0.496782 1.403191 2.426283
H  3.888607 -0.987902 2.449646
H  2.891407 -1.688523 1.203506
H  -0.960076 -0.79287 1.490266
H  -1.834672 -1.292225 2.920024
H  5.08303 -0.374914 0.575633
H  4.143313 1.066267 0.844013
H  -2.713426 0.998227 1.105579
H  -3.610493 0.355517 2.463381
H  3.728548 -1.158132 -1.199482
H  4.220758 0.485024 -1.5257
H  -2.859098 -1.225663 -0.039796
H  -3.769713 -1.86151 1.310066
H  -4.667707 0.48092 -0.427869
H  -5.583902 -0.213313 0.890055
H  -4.772608 -1.699048 -1.66769
H  -5.681991 -2.412992 -0.339949
H  -6.389403 -1.112717 -1.292059
H  0.73713 4.120019 -0.450284
H  -2.680211 0.830555 -1.851588
H  -1.630226 4.779607 -0.590193
H  -3.33906 3.139586 -1.298971
H  2.172422 -4.31175 -2.072298
H  0.440887 -4.369486 -2.378863
H  1.070876 -4.977099 -0.842492
elementType: O C H
totalener: -1234.88274674 hartree
nucrepener: 2844.31717004 hartree
electener: -4079.19991679 hartree
oneelecener: -7335.48275052 hartree
twoeener: 3256.28283374 hartree
cpcmener: -0.03251737 hartree
kineticenergy: 1229.30481767 hartree
xcener: -121.327767849343 hartree
chargesum: -0.0000000
charge: -0.292249 -0.424504 -0.426795 -0.448472 -0.118896 -0.175521 -0.082541 -0.125050 -0.132793 -0.064582 -0.150745 -0.136887 -0.151853 -0.119656 -0.030170 -0.093569 0.224437 0.342454 -0.024144 -0.047159 -0.280859 0.357567 -0.113098 -0.142055 -0.115081 -0.112478 0.446094 -0.231952 0.063291 0.077387 0.072994 0.073572 0.072584 -0.013598 0.075326 0.060402 0.086481 0.067133 -0.000304 0.076972 0.091186 0.078922 0.048935 0.077677 0.098156 0.109139 0.045309 0.076306 0.049761 0.066863 0.077210 0.080625 0.091168 0.138845 0.150661 0.166899 0.165868 0.116976 0.123432 0.104382
qa: -0.2922 -0.4245 -0.4268 -0.4485 -0.1189 -0.1755 -0.0825 -0.1250 -0.1328 -0.0646 -0.1507 -0.1369 -0.1519 -0.1197 -0.0302 -0.0936 0.2244 0.3425 -0.0241 -0.0472 -0.2809 0.3576 -0.1131 -0.1421 -0.1151 -0.1125 0.4461 -0.2320 0.0633 0.0774 0.0730 0.0736 0.0726 -0.0136 0.0753 0.0604 0.0865 0.0671 -0.0003 0.0770 0.0912 0.0789 0.0489 0.0777 0.0982 0.1091 0.0453 0.0763 0.0498 0.0669 0.0772 0.0806 0.0912 0.1388 0.1507 0.1669 0.1659 0.1170 0.1234 0.1044
va: 2.1335 2.0610 2.0467 2.0493 3.8516 3.9413 3.8193 3.8628 3.8575 3.8482 3.8846 3.8890 3.8655 3.8512 3.6686 3.8660 3.7489 3.9322 3.6326 3.5953 3.9414 4.0239 3.9483 3.8799 3.9290 3.8891 3.9992 3.9243 1.0124 1.0130 1.0088 1.0084 1.0170 1.0487 1.0119 1.0032 1.0083 1.0187 1.0208 1.0136 1.0079 1.0191 1.0113 1.0136 1.0192 1.0140 1.0107 1.0130 1.0068 1.0094 1.0026 1.0006 1.0045 1.0209 1.0015 0.9877 0.9906 1.0046 1.0004 1.0123
dispcorr: -0.037333258 hartree
energy: -1234.920079998696
dipole: -15.88794 16.01345 0.12552 -10.05122 10.30420 0.25298 25.14198 -25.54438 -0.40240
magnitude: 0.49161 au
magnitude: 1.24958 debye
