program: Orca
programVersion: 5.0.2
elementType: O O O O C C C C C C C C C C C C C C C C C C C C C C C C H H H H H H H H H H H H H H H H H H H H H H H H H H H H H H H H
charge: 0
multiplicity: 1
keywords: wb97x-d3
keywords: def2-TZVPP
keywords: def2/J RIJCOSX
keywords: DEFGRID2
keywords: scfconv7
keywords: smallprint printgap noloewdin
keywords: NOSOSCF
formula: C24H32O4
InChI: InChI=1/C24H32O4/c1-3-4-5-6-7-8-9-10-11-12-17-21-22(26)19-15-13-14-16-20(19)23(27)24(21)28-18(2)25/h13-16H,3-12,17H2,1-2H3
60 atoms
O  -0.09464 1.751838 1.391284
O  3.476278 2.095579 -1.628614
O  -1.696909 2.538219 -0.603807
O  -1.188428 -0.067518 0.694425
C  1.754417 -3.419093 1.810914
C  0.456893 -3.527885 1.01791
C  2.743157 -2.389294 1.271133
C  -0.469749 -4.612091 1.55454
C  2.201372 -0.964458 1.262683
C  -1.734696 -4.825302 0.725886
C  3.268963 0.075758 0.958205
C  -2.642004 -3.60638 0.573518
C  2.750327 1.519411 1.008658
C  -3.164138 -3.042529 1.889728
C  1.753672 1.835476 -0.061624
C  -4.213336 -1.953117 1.697377
C  0.432482 1.916656 0.139041
C  2.277522 2.082059 -1.432626
C  1.321009 2.289358 -2.544452
C  -0.047109 2.403372 -2.287473
C  -4.78676 -1.442644 3.010846
C  -0.5447 2.30766 -0.904873
C  1.786353 2.38313 -3.8495
C  -0.938251 2.615413 -3.331347
C  0.891884 2.583151 -4.890413
C  -0.46718 2.700403 -4.63218
C  -0.954363 0.718876 1.57212
C  -1.542777 0.716742 2.9387
H  2.240345 -4.399441 1.834693
H  1.51817 -3.173844 2.852187
H  0.689237 -3.732665 -0.033893
H  -0.06258 -2.566852 1.032497
H  3.046693 -2.667842 0.25657
H  3.652754 -2.424461 1.878653
H  0.077597 -5.559198 1.596668
H  -0.735563 -4.378134 2.590518
H  1.399248 -0.886912 0.525804
H  1.75102 -0.742155 2.237346
H  -1.447774 -5.176216 -0.270472
H  -2.314473 -5.637961 1.175055
H  3.721261 -0.128095 -0.015523
H  4.074595 -0.005515 1.692207
H  -3.495821 -3.893529 -0.048647
H  -2.125754 -2.816347 0.019286
H  3.593014 2.204687 0.905192
H  2.317406 1.70845 1.990436
H  -3.594739 -3.855898 2.486112
H  -2.335059 -2.64056 2.483401
H  -5.024865 -2.339267 1.071954
H  -3.774992 -1.119672 1.139661
H  -5.29806 -2.240618 3.554102
H  -4.002805 -1.054051 3.664868
H  -5.508293 -0.640327 2.85032
H  2.843915 2.2959 -4.058649
H  -1.997687 2.706689 -3.1332
H  1.257791 2.648642 -5.905985
H  -1.162299 2.858562 -5.44541
H  -0.877373 1.161167 3.675123
H  -1.790713 -0.300764 3.231395
H  -2.467102 1.297881 2.922932
elementType: O C H
totalener: -1234.88420587 hartree
nucrepener: 2708.30988000 hartree
electener: -3943.19408587 hartree
oneelecener: -7063.23128027 hartree
twoeener: 3120.03719439 hartree
cpcmener: -0.03247264 hartree
kineticenergy: 1229.29406114 hartree
xcener: -121.323677154437 hartree
chargesum: 0.0000000
charge: -0.289827 -0.431320 -0.420997 -0.452849 -0.127748 -0.082077 -0.153918 -0.141301 -0.094350 -0.164085 -0.170548 -0.119489 -0.116617 -0.146929 -0.067602 -0.108116 0.220462 0.436378 -0.111431 -0.066307 -0.280275 0.345537 -0.103985 -0.085568 -0.127777 -0.133016 0.474442 -0.266891 0.070564 0.063893 0.064937 0.023836 0.066833 0.070834 0.075009 0.067805 0.061929 0.065280 0.073034 0.074510 0.078782 0.078892 0.076372 0.063307 0.108730 0.099024 0.071327 0.061235 0.068761 0.057214 0.086130 0.074694 0.092985 0.141691 0.142030 0.166729 0.166875 0.127647 0.108712 0.136606
qa: -0.2898 -0.4313 -0.4210 -0.4528 -0.1277 -0.0821 -0.1539 -0.1413 -0.0943 -0.1641 -0.1705 -0.1195 -0.1166 -0.1469 -0.0676 -0.1081 0.2205 0.4364 -0.1114 -0.0663 -0.2803 0.3455 -0.1040 -0.0856 -0.1278 -0.1330 0.4744 -0.2669 0.0706 0.0639 0.0649 0.0238 0.0668 0.0708 0.0750 0.0678 0.0619 0.0653 0.0730 0.0745 0.0788 0.0789 0.0764 0.0633 0.1087 0.0990 0.0713 0.0612 0.0688 0.0572 0.0861 0.0747 0.0930 0.1417 0.1420 0.1667 0.1669 0.1276 0.1087 0.1366
va: 2.1439 2.0521 2.0642 2.0037 3.8863 3.8502 3.9222 3.8789 3.8082 3.9248 3.9363 3.8344 3.8397 3.8567 3.7563 3.8576 3.7147 3.9296 3.7729 3.7109 3.9310 4.0850 3.9428 3.9183 3.9325 3.9334 3.9042 3.9387 1.0134 1.0085 1.0122 1.0105 1.0083 1.0124 1.0116 1.0013 1.0199 1.0090 1.0083 1.0085 1.0154 1.0136 1.0125 1.0110 1.0185 1.0216 1.0129 0.9999 1.0107 1.0166 1.0015 0.9994 1.0043 1.0216 1.0189 0.9892 0.9891 1.0130 0.9983 0.9953
dispcorr: -0.032448053 hartree
energy: -1234.916653922288
dipole: -14.34433 14.57708 0.23275 -43.49617 43.83760 0.34144 27.24348 -27.17451 0.06897
magnitude: 0.41894 au
magnitude: 1.06486 debye
