program: Gaussian 09
title: 000006669
version: EM64L-G09RevD.01
frameworkgroup: C1[X(C14H18N2O5)]
method: RPBEPBE
basis: SDD
operation: Freq
keyword: #p
keyword: freq=noraman
keyword: PBEPBE/SDD
title: #p freq=noraman PBEPBE/SDD
converged: YES YES NO NO
title: Mulliken charges:
elementType: O O O O O N N C C C C C C C C C C C C C C H H H H H H H H H H H H H H H H H H
charge: -0.173223 -0.170275 -0.169555 -0.173501 -0.178212 -0.025157 -0.026861 0.133812 0.228239 0.111133 0.111809 -0.725107 -0.717158 -0.724902 0.168072 0.152108 0.099422 -0.806344 -0.815268 0.024039 -0.756722 0.219721 0.244438 0.229002 0.216353 0.249059 0.248156 0.220020 0.228641 0.244226 0.269450 0.255464 0.257542 0.257732 0.271363 0.249394 0.251348 0.257761 0.263980
chargesum: 0.00000
title: Mulliken charges with hydrogens summed into heavy atoms:
elementType: O O O O O N N C C C C C C C C C C C C C C
charge: -0.173223 -0.170275 -0.169555 -0.173501 -0.178212 -0.025157 -0.026861 0.133812 0.228239 0.111133 0.111809 -0.031946 -0.003590 -0.032014 0.168072 0.152108 0.099422 -0.023888 -0.036780 0.024039 0.016367
polarizability: 2.22206512e+02 -5.03830594e-01 2.02688899e+02 5.55028680e+00 1.19391812e+00 1.40764173e+02
1716.lowfreq: -8.5464 -0.0008 -0.0006 -0.0005 2.1780 4.5883 33.7063 38.3204 61.3615
frequency: 33.6453 38.3141 61.3354 74.1671 79.0306 101.2854 111.0136 131.8926 134.7152 140.0115 158.1223 164.4766 167.4134 173.2581 198.6339 215.3613 224.4296 237.4642 257.2685 259.7770 268.7307 289.9716 305.1835 328.2171 340.7868 350.9557 390.4501 411.7545 419.1748 442.6894 454.1071 493.1254 522.7955 553.9041 570.9833 580.0662 623.2224 647.7722 675.6220 689.8490 709.3997 750.9776 755.5109 761.4097 815.3858 830.4377 917.3023 927.3874 932.6359 946.7465 967.8063 991.5278 1016.8638 1027.3022 1031.2413 1036.0308 1040.6705 1047.4067 1067.6504 1105.5810 1197.2648 1198.3836 1203.4826 1219.2545 1237.5649 1261.9604 1280.5700 1326.4429 1357.1781 1366.9012 1369.1865 1371.6347 1383.4685 1386.1119 1402.9813 1408.5781 1414.5158 1417.4968 1437.6873 1446.0400 1459.1666 1461.7120 1466.7189 1473.3958 1474.4516 1490.2295 1494.3604 1498.6252 1508.8014 1534.7656 1552.2013 1567.7916 1617.2528 2979.8925 2985.8525 2995.2881 2998.7482 2998.8213 3004.0073 3064.7843 3074.3111 3075.1413 3082.4052 3083.6540 3092.9057 3100.4831 3107.0404 3121.2349 3126.2672 3126.9252 3129.1307
redmass: 4.5077 5.6477 3.1822 5.1886 4.0975 7.7065 7.6334 1.2319 2.7691 2.1435 1.2262 1.5822 4.5524 2.8723 3.3314 1.8250 5.4512 3.5456 1.2369 2.1130 2.4419 4.5406 3.2021 2.2227 1.7550 4.4300 2.7196 3.2027 3.9534 4.3466 2.9302 3.7019 4.7930 4.9548 4.2721 2.4599 5.8339 6.3979 7.1524 6.5990 8.9767 5.3567 6.7899 5.7792 3.6218 9.6751 2.4145 2.5445 1.8421 1.1996 2.1218 3.5388 1.9604 1.3527 1.4175 1.3936 1.5335 1.5144 1.6937 4.5020 2.8536 2.8515 2.7129 5.4790 13.1422 9.5766 6.4861 9.2838 7.7275 3.9141 3.6126 1.2372 1.3398 1.4568 2.0918 1.2380 1.3036 1.5780 1.0800 1.0647 1.0620 1.1212 1.1480 1.0709 1.0575 1.0889 1.0900 1.0721 1.0482 1.0568 6.4443 7.0812 8.4004 1.0382 1.0349 1.0381 1.0383 1.0397 1.0386 1.0937 1.0974 1.0977 1.1000 1.0993 1.0981 1.1012 1.0991 1.1015 1.0974 1.0976 1.0977
irintensity: 4.1997 1.2034 0.0884 4.0677 0.1899 0.4680 0.6812 1.0503 0.8729 1.8460 0.7105 0.3404 3.8159 1.9493 5.7463 0.4267 0.2912 2.2907 0.0243 0.4994 1.1608 0.2905 4.8786 0.2098 0.0234 2.5392 0.9554 0.0978 0.3282 3.1275 3.1557 0.1166 3.8081 7.5086 5.3997 0.2101 4.4659 26.0806 0.4359 5.3723 1.2737 5.7136 1.1283 7.7277 1.2948 10.7870 0.0927 3.9639 2.8823 0.0540 14.9034 2.1687 2.2937 3.5705 7.1387 0.2337 2.7848 1.0663 1.8645 24.5009 4.5611 0.8534 71.2028 98.6339 178.0318 1.2266 17.9232 2.5424 0.3982 268.0909 7.0572 88.1640 5.1940 23.8747 16.6572 35.8211 30.1242 11.3691 23.4253 25.8714 0.9960 11.2752 17.8358 14.8936 2.2342 0.2648 15.9606 24.1099 3.7479 28.2566 8.5724 15.6515 113.1255 0.6937 23.7229 6.5429 8.6690 5.6281 32.7420 6.4374 3.9219 5.9528 1.7898 9.6256 68.5485 5.1985 10.8152 11.0122 7.1975 14.9921 13.3577
temp: 298.150 k
press: 1.00000 atm
elementType: 8 8 8 8 8 7 7 6 6 6 6 6 6 6 6 6 6 6 6 6 6 1 1 1 1 1 1 1 1 1 1 1 1 1 1 1 1 1 1
symmnumber: 1
zpe: 792127.2 jmol-1
zpe.correction: 0.301705 hartree
zpe.thermalcorrener: 0.324310 hartree
zpe.thermalcorrenthalpy: 0.325255 hartree
zpe.thermalcorrgfe: 0.250754 hartree
zpe.sumelectzpe: -1028.141443 hartree
zpe.sumelectthermal: -1028.118838 hartree
zpe.sumelectthermalent: -1028.117894 hartree
zpe.sumelectthermalfe: -1028.192395 hartree
dipole: 1.5925 0.4956 3.0476
dipole: 3.4741
quadrupole: -118.3548 -140.1442 -130.6244
quadrupole: 1.9557 7.5112 -0.5414
quadrupole: 11.3530 -10.4364 -0.9166 1.9557 7.5112 -0.5414
hfenergy: -1028.4431487 hartree
pointgroup: C01 [X(C14H18N2O5)]
dipole: 0.5751323 -0.3058392 -1.2016276 debye
polarizability: 221.6213505|-0.3802328|202.4305223|-8.8648599|-4.105007|141.6077109 unknown
InChI: InChI=1S/C14H18N2O5/c1-7-10(9(3)17)8(2)13(16(20)21)11(14(4,5)6)12(7)15(18)19/h1-6H3
charge 0 multiplicity 1
39 atoms
O  -1.371637 2.987621 1.023235
O  -0.715579 -3.361438 -0.500272
O  -0.775124 3.269208 -1.157919
O  -1.34093 -2.657113 1.574406
O  4.128509 0.399943 0.958899
N  -0.846624 2.572422 -0.078322
N  -0.812232 -2.461598 0.415245
C  -2.561138 0.021259 -0.068029
C  -0.99417 0.039762 0.007629
C  -0.206823 1.225505 -0.066825
C  -0.193037 -1.130076 0.158609
C  -3.135778 1.180537 -0.947692
C  -3.128325 0.152574 1.381714
C  -3.114155 -1.290376 -0.718623
C  1.213448 1.284645 -0.075679
C  1.226376 -1.169637 0.150959
C  1.919451 0.057752 0.004584
C  1.940109 2.615549 -0.171858
C  1.978111 -2.478378 0.335727
C  3.444237 0.056044 -0.039469
C  4.077172 -0.335583 -1.365362
H  -4.2007 0.962817 -1.138693
H  -3.110794 2.16343 -0.455914
H  -2.629512 1.251738 -1.926791
H  -4.233211 0.138634 1.339653
H  -2.793178 -0.68505 2.016799
H  -2.809223 1.100692 1.84733
H  -4.180832 -1.128326 -0.950875
H  -2.600924 -1.535045 -1.665613
H  -3.078521 -2.164102 -0.052406
H  1.82298 3.056081 -1.17804
H  1.532729 3.348667 0.547386
H  3.011383 2.506917 0.048358
H  1.553681 -3.073754 1.163619
H  1.917969 -3.105144 -0.571879
H  3.037793 -2.302691 0.57645
H  3.847134 0.442458 -2.12023
H  3.65267 -1.279734 -1.751792
H  5.169693 -0.42421 -1.259721
