program: Orca
programVersion: 5.0.2
elementType: O O O O C C C C C C C C C C C C C C C C C C C C C C C C H H H H H H H H H H H H H H H H H H H H H H H H H H H H H H H H
charge: 0
multiplicity: 1
keywords: wb97x-d3
keywords: def2-TZVPP
keywords: def2/J RIJCOSX
keywords: DEFGRID2
keywords: scfconv7
keywords: smallprint printgap noloewdin
keywords: NOSOSCF
formula: C24H32O4
InChI: InChI=1/C24H32O4/c1-3-4-5-6-7-8-9-10-11-12-17-21-22(26)19-15-13-14-16-20(19)23(27)24(21)28-18(2)25/h13-16H,3-12,17H2,1-2H3
60 atoms
O  3.237524 -1.315333 -2.432673
O  1.625319 2.142592 0.265745
O  0.950863 -1.141623 -3.794949
O  2.097807 -3.118584 -1.76582
C  0.933748 -0.223484 3.571501
C  -0.211916 0.318991 2.723979
C  2.290164 -0.174978 2.869569
C  -1.573912 0.231588 3.399171
C  2.434429 -1.206424 1.753919
C  -2.692357 0.796286 2.532155
C  3.68437 -1.042747 0.89535
C  -4.066402 0.736605 3.184818
C  3.682824 0.184722 -0.032219
C  -5.165747 1.324511 2.309626
C  2.448165 0.263044 -0.877384
C  -6.545383 1.27314 2.952792
C  2.247737 -0.501757 -1.956826
C  1.391684 1.249384 -0.523149
C  0.054447 1.117009 -1.144678
C  -0.131491 0.275022 -2.242549
C  -7.629954 1.878683 2.074608
C  1.006336 -0.499329 -2.766493
C  -1.017016 1.843139 -0.642189
C  -1.382673 0.166665 -2.835178
C  -2.271082 1.711848 -1.220298
C  -2.453363 0.878262 -2.315233
C  3.025384 -2.656281 -2.371636
C  4.066002 -3.401968 -3.128545
H  0.714998 -1.255015 3.86973
H  0.988102 0.353223 4.499767
H  -0.257706 -0.214738 1.76924
H  -0.00409 1.365033 2.475196
H  3.084978 -0.346736 3.601663
H  2.455139 0.836062 2.486646
H  -1.794805 -0.812609 3.64549
H  -1.545123 0.769158 4.353298
H  2.455814 -2.201696 2.207125
H  1.551686 -1.204769 1.106133
H  -2.459773 1.836225 2.276234
H  -2.720241 0.252969 1.581066
H  3.822223 -1.943887 0.295362
H  4.5679 -0.972254 1.535712
H  -4.038902 1.271757 4.140263
H  -4.310419 -0.303412 3.427028
H  4.565651 0.14173 -0.672001
H  3.775032 1.096688 0.555199
H  -4.918299 2.364311 2.068387
H  -5.192115 0.791483 1.352623
H  -6.51671 1.798593 3.912236
H  -6.799022 0.23427 3.184494
H  -7.706972 1.353424 1.120683
H  -8.608802 1.832753 2.553648
H  -7.42127 2.927382 1.854364
H  -0.882621 2.496973 0.2086
H  -1.527133 -0.480308 -3.689751
H  -3.10851 2.261872 -0.812581
H  -3.431582 0.782456 -2.766203
H  5.062475 -3.016359 -2.918355
H  3.885435 -3.277609 -4.198022
H  4.023873 -4.460213 -2.888511
elementType: O C H
totalener: -1234.88323650 hartree
nucrepener: 2681.95963472 hartree
electener: -3916.84287121 hartree
oneelecener: -7010.05182326 hartree
twoeener: 3093.20895205 hartree
cpcmener: -0.03250760 hartree
kineticenergy: 1229.29874294 hartree
xcener: -121.323686384855 hartree
chargesum: 0.0000000
charge: -0.292180 -0.419727 -0.422651 -0.438131 -0.150212 -0.076715 -0.143667 -0.155929 -0.124310 -0.073422 -0.167589 -0.132249 -0.157739 -0.095042 0.026254 -0.082487 0.179208 0.322269 -0.018456 -0.070825 -0.283435 0.368367 -0.138933 -0.092062 -0.132883 -0.125296 0.425705 -0.231536 0.061164 0.074027 0.052730 0.050494 0.080101 0.067871 0.059577 0.059663 0.086143 0.062234 0.058424 0.054740 0.094516 0.086368 0.056708 0.057524 0.105357 0.102947 0.055080 0.054688 0.053476 0.053927 0.077689 0.090102 0.077823 0.149788 0.142109 0.166105 0.166388 0.118898 0.124170 0.102841
qa: -0.2922 -0.4197 -0.4227 -0.4381 -0.1502 -0.0767 -0.1437 -0.1559 -0.1243 -0.0734 -0.1676 -0.1322 -0.1577 -0.0950 0.0263 -0.0825 0.1792 0.3223 -0.0185 -0.0708 -0.2834 0.3684 -0.1389 -0.0921 -0.1329 -0.1253 0.4257 -0.2315 0.0612 0.0740 0.0527 0.0505 0.0801 0.0679 0.0596 0.0597 0.0861 0.0622 0.0584 0.0547 0.0945 0.0864 0.0567 0.0575 0.1054 0.1029 0.0551 0.0547 0.0535 0.0539 0.0777 0.0901 0.0778 0.1498 0.1421 0.1661 0.1664 0.1189 0.1242 0.1028
va: 2.1289 2.0541 2.0621 2.0477 3.9617 3.8540 3.8737 3.9471 3.8433 3.8674 3.9051 3.9225 3.8290 3.8700 3.6434 3.8804 3.8030 3.9636 3.6240 3.7206 3.9472 4.0454 3.8926 3.9268 3.8988 3.9425 4.0291 3.9238 1.0080 1.0091 1.0078 1.0134 1.0131 1.0177 1.0099 1.0105 1.0087 1.0160 1.0068 1.0053 1.0111 1.0123 1.0104 1.0100 1.0142 1.0194 1.0086 1.0087 1.0071 1.0071 1.0007 1.0044 1.0004 1.0146 1.0186 0.9898 0.9886 1.0033 1.0006 1.0132
dispcorr: -0.032760295 hartree
energy: -1234.915996790952
dipole: -30.13274 30.21813 0.08539 3.65333 -3.48261 0.17071 39.92889 -39.91973 0.00917
magnitude: 0.19110 au
magnitude: 0.48574 debye
