program: Orca
programVersion: 5.0.2
elementType: O O O O C C C C C C C C C C C C C C C C C C C C C C C C H H H H H H H H H H H H H H H H H H H H H H H H H H H H H H H H
charge: 0
multiplicity: 1
keywords: wb97x-d3
keywords: def2-TZVPP
keywords: def2/J RIJCOSX
keywords: DEFGRID2
keywords: scfconv7
keywords: smallprint printgap noloewdin
keywords: NOSOSCF
formula: C24H32O4
InChI: InChI=1/C24H32O4/c1-3-4-5-6-7-8-9-10-11-12-17-21-22(26)19-15-13-14-16-20(19)23(27)24(21)28-18(2)25/h13-16H,3-12,17H2,1-2H3
60 atoms
O  2.42612 -1.801193 -1.886012
O  1.781038 2.570141 -0.363338
O  -0.076228 -1.713284 -2.840927
O  1.220604 -3.159515 -0.579075
C  1.247218 -1.181352 2.54137
C  -0.205053 -1.287277 2.995855
C  1.752887 0.248418 2.407053
C  -1.209907 -0.616171 2.064633
C  3.253019 0.358539 2.137362
C  -2.651403 -0.919031 2.459521
C  3.802157 -0.344784 0.896127
C  -3.706251 -0.140889 1.677705
C  3.56142 0.356634 -0.449437
C  -3.716712 1.354684 1.972811
C  2.148301 0.32506 -0.940376
C  -4.877124 2.091256 1.316196
C  1.632037 -0.732614 -1.5803
C  1.300029 1.53758 -0.785651
C  -0.133786 1.459446 -1.150048
C  -0.638936 0.332287 -1.801659
C  -4.841156 3.590337 1.571797
C  0.260767 -0.784793 -2.135468
C  -0.978678 2.522257 -0.858055
C  -1.980555 0.271986 -2.155315
C  -2.319209 2.455532 -1.20705
C  -2.820075 1.332433 -1.851319
C  2.097676 -3.019378 -1.386715
C  2.949849 -4.089104 -1.972834
H  1.353725 -1.700777 1.58614
H  1.883124 -1.720658 3.251235
H  -0.307636 -0.85874 3.998755
H  -0.463917 -2.346595 3.094007
H  1.540075 0.789402 3.335189
H  1.180181 0.768629 1.637559
H  -1.042324 0.464369 2.062485
H  -1.038113 -0.951815 1.034463
H  3.535417 1.415138 2.09731
H  3.776557 -0.05415 3.005189
H  -2.82933 -1.991646 2.335376
H  -2.783057 -0.715393 3.52835
H  3.446023 -1.376544 0.846695
H  4.886657 -0.413924 1.006229
H  -4.692902 -0.552316 1.913692
H  -3.562072 -0.300819 0.603026
H  4.199611 -0.118137 -1.19606
H  3.896479 1.391053 -0.3759
H  -3.764851 1.506702 3.057106
H  -2.775571 1.809165 1.647234
H  -5.821633 1.678617 1.683756
H  -4.866983 1.903866 0.238002
H  -4.875625 3.811383 2.640476
H  -3.927312 4.038346 1.175736
H  -5.685044 4.099846 1.10466
H  -0.598418 3.400982 -0.355226
H  -2.373576 -0.599411 -2.661445
H  -2.976398 3.281628 -0.970755
H  -3.866913 1.283159 -2.118583
H  2.607043 -4.299494 -2.988093
H  2.871221 -4.998998 -1.385135
H  3.991825 -3.779902 -2.036484
elementType: O C H
totalener: -1234.88044180 hartree
nucrepener: 2815.72125970 hartree
electener: -4050.60170150 hartree
oneelecener: -7277.72325936 hartree
twoeener: 3227.12155785 hartree
cpcmener: -0.03308977 hartree
kineticenergy: 1229.29743453 hartree
xcener: -121.327890809036 hartree
chargesum: 0.0000000
charge: -0.289856 -0.426040 -0.422814 -0.442756 -0.119698 -0.162446 -0.088638 -0.091788 -0.186611 -0.143438 -0.141491 -0.123205 -0.127369 -0.140055 -0.020833 -0.105155 0.161220 0.388324 -0.030223 -0.116455 -0.280082 0.384667 -0.122058 -0.050525 -0.112803 -0.179992 0.440883 -0.230150 0.039911 0.081389 0.065446 0.069596 0.082792 0.043886 0.073666 0.039384 0.075200 0.083730 0.074338 0.062165 0.081559 0.091977 0.079696 0.059149 0.104691 0.097033 0.077931 0.052977 0.071057 0.055807 0.084840 0.072244 0.092693 0.135971 0.139597 0.177983 0.167817 0.124264 0.103335 0.117264
qa: -0.2899 -0.4260 -0.4228 -0.4428 -0.1197 -0.1624 -0.0886 -0.0918 -0.1866 -0.1434 -0.1415 -0.1232 -0.1274 -0.1401 -0.0208 -0.1052 0.1612 0.3883 -0.0302 -0.1165 -0.2801 0.3847 -0.1221 -0.0505 -0.1128 -0.1800 0.4409 -0.2301 0.0399 0.0814 0.0654 0.0696 0.0828 0.0439 0.0737 0.0394 0.0752 0.0837 0.0743 0.0622 0.0816 0.0920 0.0797 0.0591 0.1047 0.0970 0.0779 0.0530 0.0711 0.0558 0.0848 0.0722 0.0927 0.1360 0.1396 0.1780 0.1678 0.1243 0.1033 0.1173
va: 2.1284 2.0531 2.0666 2.0463 3.8608 3.9353 3.8645 3.8568 3.9479 3.9254 3.8693 3.8755 3.8356 3.8418 3.7037 3.8629 3.8214 3.9071 3.5945 3.6397 3.9369 4.0276 3.9098 3.8511 3.8424 3.9182 4.0073 3.9220 1.0326 1.0142 1.0101 1.0098 1.0107 1.0136 0.9950 1.0206 1.0108 1.0051 1.0104 1.0085 1.0107 1.0066 1.0109 1.0137 1.0140 1.0276 1.0115 1.0032 1.0102 1.0067 1.0017 1.0021 1.0036 1.0275 1.0190 0.9750 0.9900 1.0001 1.0130 1.0036
dispcorr: -0.037285030 hartree
energy: -1234.917726830376
dipole: -17.31112 17.50835 0.19723 4.44269 -4.18928 0.25342 31.65454 -31.89860 -0.24406
magnitude: 0.40334 au
magnitude: 1.02522 debye
