program: Orca
programVersion: 5.0.2
elementType: O O O O C C C C C C C C C C C C C C C C C C C C C C C C H H H H H H H H H H H H H H H H H H H H H H H H H H H H H H H H
charge: 0
multiplicity: 1
keywords: wb97x-d3
keywords: def2-TZVPP
keywords: def2/J RIJCOSX
keywords: DEFGRID2
keywords: scfconv7
keywords: smallprint printgap noloewdin
keywords: NOSOSCF
formula: C24H32O4
InChI: InChI=1/C24H32O4/c1-3-4-5-6-7-8-9-10-11-12-17-21-22(26)19-15-13-14-16-20(19)23(27)24(21)28-18(2)25/h13-16H,3-12,17H2,1-2H3
60 atoms
O  3.672189 0.438348 -1.942303
O  0.358808 -2.784546 -1.203553
O  1.70325 2.17541 -2.416058
O  3.602662 1.630623 -0.052908
C  0.197367 -1.227703 2.296875
C  -0.569682 0.082602 2.42476
C  1.628651 -1.014442 1.820212
C  -2.049376 -0.093529 2.73881
C  2.394272 -2.307149 1.521546
C  -2.788995 1.237582 2.813917
C  3.537114 -2.141145 0.517912
C  -4.284969 1.120365 3.090428
C  3.133353 -2.209743 -0.967912
C  -5.087717 0.508827 1.947942
C  2.093058 -1.207597 -1.354558
C  -6.581242 0.438712 2.239712
C  2.377542 0.040154 -1.743882
C  0.660321 -1.612435 -1.30284
C  -0.377535 -0.558753 -1.347725
C  -0.036476 0.752151 -1.684767
C  -7.381731 -0.155503 1.090742
C  1.362874 1.085853 -2.002526
C  -1.694837 -0.873355 -1.041524
C  -1.011771 1.740752 -1.71014
C  -2.662606 0.119985 -1.052864
C  -2.321643 1.424444 -1.383808
C  4.187119 1.329847 -1.058204
C  5.502328 1.851039 -1.518912
H  -0.322241 -1.878137 1.58435
H  0.190603 -1.762153 3.252577
H  -0.47426 0.639827 1.485111
H  -0.102534 0.707699 3.193393
H  2.183115 -0.434145 2.564402
H  1.597068 -0.373259 0.93666
H  -2.499776 -0.732745 1.97265
H  -2.166488 -0.628796 3.687409
H  2.801868 -2.697527 2.456967
H  1.707298 -3.079554 1.162683
H  -2.328068 1.848956 3.595876
H  -2.638617 1.785695 1.876381
H  4.271545 -2.935174 0.667128
H  4.064357 -1.202967 0.710455
H  -4.684781 2.11694 3.30197
H  -4.441766 0.533119 4.001874
H  2.765641 -3.21212 -1.187115
H  4.026737 -2.065705 -1.575564
H  -4.925447 1.099624 1.038952
H  -4.720742 -0.497864 1.723824
H  -6.954086 1.442767 2.463924
H  -6.745142 -0.154302 3.144556
H  -7.269558 0.437924 0.18128
H  -7.052308 -1.17081 0.861725
H  -8.446448 -0.200943 1.323528
H  -1.965287 -1.88733 -0.780538
H  -0.749068 2.756374 -1.973585
H  -3.685118 -0.125239 -0.799921
H  -3.078356 2.197288 -1.389619
H  6.13202 1.054653 -1.912026
H  6.014694 2.357863 -0.706561
H  5.335194 2.566775 -2.326334
elementType: O C H
totalener: -1234.88001817 hartree
nucrepener: 2744.81943036 hartree
electener: -3979.69944853 hartree
oneelecener: -7135.73158224 hartree
twoeener: 3156.03213370 hartree
cpcmener: -0.03283976 hartree
kineticenergy: 1229.30020992 hartree
xcener: -121.326272530958 hartree
chargesum: -0.0000000
charge: -0.294117 -0.417699 -0.424093 -0.443535 -0.151629 -0.130219 -0.078107 -0.148701 -0.172833 -0.120159 -0.147695 -0.138174 -0.145663 -0.108042 0.070401 -0.090998 0.138615 0.287262 -0.024281 -0.080934 -0.276203 0.401445 -0.119663 -0.067493 -0.143307 -0.143669 0.432820 -0.232297 0.061505 0.086366 0.048384 0.083936 0.093290 0.007815 0.064391 0.077617 0.090989 0.072425 0.080541 0.058591 0.092109 0.081125 0.072309 0.059404 0.101647 0.101816 0.049149 0.061953 0.055139 0.055856 0.077118 0.077157 0.091193 0.142237 0.140907 0.173473 0.166026 0.118243 0.102744 0.123511
qa: -0.2941 -0.4177 -0.4241 -0.4435 -0.1516 -0.1302 -0.0781 -0.1487 -0.1728 -0.1202 -0.1477 -0.1382 -0.1457 -0.1080 0.0704 -0.0910 0.1386 0.2873 -0.0243 -0.0809 -0.2762 0.4014 -0.1197 -0.0675 -0.1433 -0.1437 0.4328 -0.2323 0.0615 0.0864 0.0484 0.0839 0.0933 0.0078 0.0644 0.0776 0.0910 0.0724 0.0805 0.0586 0.0921 0.0811 0.0723 0.0594 0.1016 0.1018 0.0491 0.0620 0.0551 0.0559 0.0771 0.0772 0.0912 0.1422 0.1409 0.1735 0.1660 0.1182 0.1027 0.1235
va: 2.1313 2.0528 2.0623 2.0489 3.9020 3.8588 3.8200 3.8559 3.8853 3.8752 3.9024 3.9152 3.8473 3.8709 3.6500 3.8955 3.8048 3.9742 3.5823 3.6770 3.9400 4.0370 3.8775 3.9107 3.8711 3.9015 4.0296 3.9224 1.0054 1.0115 1.0079 1.0136 1.0078 1.0401 1.0052 1.0139 1.0066 1.0138 1.0121 1.0110 1.0082 1.0135 1.0097 1.0090 1.0245 1.0164 1.0069 1.0037 1.0076 1.0067 1.0010 1.0013 1.0045 1.0236 1.0182 0.9804 0.9904 1.0037 1.0130 1.0006
dispcorr: -0.035742505 hartree
energy: -1234.915760675969
dipole: -31.71796 31.65647 -0.06149 -3.23911 3.09437 -0.14474 32.55078 -32.63753 -0.08676
magnitude: 0.17961 au
magnitude: 0.45652 debye
