program: Orca
programVersion: 5.0.2
elementType: O O O O C C C C C C C C C C C C C C C C C C C C C C C C H H H H H H H H H H H H H H H H H H H H H H H H H H H H H H H H
charge: 0
multiplicity: 1
keywords: wb97x-d3
keywords: def2-TZVPP
keywords: def2/J RIJCOSX
keywords: DEFGRID2
keywords: scfconv7
keywords: smallprint printgap noloewdin
keywords: NOSOSCF
formula: C24H32O4
InChI: InChI=1/C24H32O4/c1-3-4-5-6-7-8-9-10-11-12-17-21-22(26)19-15-13-14-16-20(19)23(27)24(21)28-18(2)25/h13-16H,3-12,17H2,1-2H3
60 atoms
O  2.173086 -1.866074 -1.824889
O  2.224424 2.604942 -0.45441
O  -0.369133 -1.494994 -2.571946
O  0.928205 -3.000369 -0.351689
C  1.523442 -0.958407 2.769351
C  0.059016 -0.89809 3.19239
C  2.10977 0.39585 2.392627
C  -0.887825 -0.418047 2.097434
C  3.587181 0.3519 2.007983
C  -2.353753 -0.501625 2.501576
C  3.958598 -0.479104 0.779963
C  -3.292889 0.060154 1.443465
C  3.694346 0.175353 -0.585324
C  -4.764878 -0.044376 1.821993
C  2.252335 0.313669 -0.964415
C  -5.711378 0.567363 0.791998
C  1.554019 -0.688634 -1.515345
C  1.582825 1.63349 -0.801443
C  0.130883 1.74063 -1.079245
C  -0.561967 0.671759 -1.651403
C  -5.642205 2.086597 0.721654
C  0.147599 -0.58012 -1.963964
C  -0.542695 2.921136 -0.792402
C  -1.914552 0.791039 -1.942763
C  -1.897031 3.030814 -1.071215
C  -2.580759 1.970566 -1.649898
C  1.742629 -3.007803 -1.233827
C  2.399341 -4.202624 -1.829741
H  1.61675 -1.653732 1.930887
H  2.116192 -1.38734 3.584089
H  -0.043172 -0.247337 4.068061
H  -0.25442 -1.894886 3.518917
H  1.999717 1.075687 3.244324
H  1.515301 0.84026 1.593158
H  -0.655712 0.61686 1.826348
H  -0.724599 -1.011008 1.189742
H  3.954641 1.372863 1.866521
H  4.143472 -0.046389 2.862042
H  -2.615605 -1.544329 2.711884
H  -2.502022 0.043338 3.440373
H  3.48444 -1.462293 0.817761
H  5.033471 -0.669655 0.815889
H  -3.130546 -0.467667 0.497202
H  -3.024919 1.104558 1.255011
H  4.197093 -0.422317 -1.347662
H  4.169303 1.156456 -0.604462
H  -5.017824 -1.100163 1.960863
H  -4.930163 0.435886 2.792946
H  -6.737149 0.272174 1.028165
H  -5.494995 0.143138 -0.193819
H  -6.330954 2.479882 -0.027427
H  -5.909793 2.535442 1.68025
H  -4.644688 2.443816 0.462342
H  -0.018511 3.756196 -0.348949
H  -2.452146 -0.033704 -2.38985
H  -2.419981 3.948358 -0.837976
H  -3.636431 2.059887 -1.867288
H  2.28419 -5.062001 -1.175611
H  3.455168 -4.025386 -2.025318
H  1.920604 -4.428323 -2.784904
elementType: O C H
totalener: -1234.88079334 hartree
nucrepener: 2807.69860884 hartree
electener: -4042.57940217 hartree
oneelecener: -7261.91186783 hartree
twoeener: 3219.33246566 hartree
cpcmener: -0.03284349 hartree
kineticenergy: 1229.30185442 hartree
xcener: -121.328652640837 hartree
chargesum: 0.0000000
charge: -0.289050 -0.425111 -0.423755 -0.445648 -0.145636 -0.151722 -0.073703 -0.057680 -0.184232 -0.164982 -0.144824 -0.092694 -0.128371 -0.128530 -0.053145 -0.102387 0.183790 0.430480 -0.112816 -0.050915 -0.278598 0.365509 -0.083068 -0.093205 -0.117502 -0.159365 0.440770 -0.229921 0.055081 0.080097 0.063994 0.069696 0.083978 0.033675 0.055728 0.040320 0.077259 0.083474 0.060644 0.060094 0.080667 0.092051 0.061882 0.052699 0.104790 0.098018 0.069701 0.059746 0.074252 0.054590 0.093804 0.086273 0.062858 0.138718 0.139530 0.165247 0.172735 0.104065 0.116795 0.123851
qa: -0.2891 -0.4251 -0.4238 -0.4456 -0.1456 -0.1517 -0.0737 -0.0577 -0.1842 -0.1650 -0.1448 -0.0927 -0.1284 -0.1285 -0.0531 -0.1024 0.1838 0.4305 -0.1128 -0.0509 -0.2786 0.3655 -0.0831 -0.0932 -0.1175 -0.1594 0.4408 -0.2299 0.0551 0.0801 0.0640 0.0697 0.0840 0.0337 0.0557 0.0403 0.0773 0.0835 0.0606 0.0601 0.0807 0.0921 0.0619 0.0527 0.1048 0.0980 0.0697 0.0597 0.0743 0.0546 0.0938 0.0863 0.0629 0.1387 0.1395 0.1652 0.1727 0.1041 0.1168 0.1239
va: 2.1272 2.0555 2.0629 2.0482 3.8742 3.9304 3.8563 3.8492 3.9363 3.9719 3.8758 3.8672 3.8357 3.9113 3.7233 3.8749 3.8071 3.8679 3.6717 3.5953 3.9294 4.0118 3.9201 3.8409 3.8865 3.8818 4.0095 3.9205 1.0272 1.0154 1.0097 1.0096 1.0117 1.0176 1.0093 1.0250 1.0110 1.0059 1.0107 1.0087 1.0113 1.0070 1.0061 1.0062 1.0135 1.0269 1.0108 1.0081 1.0068 1.0102 1.0033 1.0053 0.9982 1.0219 1.0234 0.9903 0.9810 1.0126 1.0041 1.0002
dispcorr: -0.036874654 hartree
energy: -1234.917667990452
dipole: -18.79674 19.02475 0.22801 -0.99454 1.23864 0.24410 28.59063 -28.93470 -0.34407
magnitude: 0.47954 au
magnitude: 1.21889 debye
