program: Gaussian 09
title: 000054977
version: EM64L-G09RevD.01
frameworkgroup: C1[X(C16H26N2O4)]
method: RPBEPBE
basis: SDD
operation: Freq
keyword: #p
keyword: freq=noraman
keyword: PBEPBE/SDD
title: #p freq=noraman PBEPBE/SDD
converged: YES YES NO NO
title: Mulliken charges:
elementType: O O O O N N C C C C C C C C C C C C C C C C H H H H H H H H H H H H H H H H H H H H H H H H H H
charge: -0.449321 -0.319060 -0.313457 -0.271491 -0.345570 -0.469162 0.268983 -0.426760 -0.136329 -0.726494 -0.680418 -0.693195 -0.309307 0.438757 -0.540835 -0.384648 0.517929 -0.186967 -0.485358 0.263517 -0.214594 -0.673551 0.242076 0.231957 0.225757 0.210743 0.210853 0.230075 0.201599 0.222462 0.216354 0.203542 0.227627 0.204580 0.209852 0.235818 0.228784 0.354751 0.317042 0.254379 0.223906 0.224977 0.330773 0.229370 0.228563 0.213134 0.229304 0.229053
chargesum: 0.00000
title: Mulliken charges with hydrogens summed into heavy atoms:
elementType: O O O O N N C C C C C C C C C C C C C C C C
charge: -0.094570 -0.319060 -0.313457 -0.271491 -0.103493 -0.138388 0.268983 0.030953 0.074413 -0.083968 -0.038059 -0.051136 0.155295 0.438757 -0.223792 -0.130269 0.517929 0.036939 -0.260381 0.263517 0.243339 -0.002060
polarizability: 2.69241016e+02 -2.40233474e+01 1.94131557e+02 -1.10706544e+01 -2.41292202e+01 1.71324565e+02
1716.lowfreq: -4.8607 -0.0011 -0.0002 0.0008 1.8492 6.1054 15.0492 19.2876 21.8365
frequency: 14.6733 18.8593 21.7663 30.7184 50.4354 54.6508 67.6724 69.6896 97.2252 108.7935 127.3206 135.2710 166.8906 181.5076 190.5183 227.1961 233.0600 245.7828 247.5955 255.5742 260.3604 260.8629 296.9414 301.9989 321.8491 334.6858 368.2648 371.5513 403.3850 425.8317 439.2550 448.7997 454.7759 469.2308 494.5136 536.0718 590.4226 607.1698 640.1259 642.8444 663.7676 687.2893 701.5676 707.8142 739.3652 765.1887 775.6604 800.7348 837.9396 849.0138 854.4508 881.9078 896.6908 905.0258 913.8961 922.9525 933.0343 939.8469 956.4627 970.2379 981.3172 994.5504 1005.2893 1017.8794 1027.5026 1046.0016 1076.9039 1098.7398 1102.4347 1111.7415 1114.9359 1140.5993 1150.8663 1172.7648 1176.5256 1194.9130 1210.9962 1222.5746 1240.3856 1243.4422 1250.8390 1269.2200 1274.4720 1291.3588 1328.3149 1348.4308 1358.4525 1361.1885 1368.8129 1373.1852 1377.0735 1395.4322 1398.5293 1400.6897 1443.1750 1447.7924 1455.2271 1460.5742 1462.1572 1462.9071 1464.4139 1476.5088 1476.7125 1477.8398 1486.0527 1488.1594 1490.4673 1496.1552 1519.6385 1596.6082 1624.9038 1663.6583 2935.7500 2966.1412 2970.7346 2980.7477 2982.8940 2995.9885 3008.4785 3030.6255 3055.7553 3060.1802 3061.2604 3066.4999 3066.7552 3069.4664 3078.1540 3085.5929 3091.7258 3093.1911 3106.6882 3124.6145 3148.6149 3178.0394 3191.4698 3416.4066 3529.9986 3547.2332
redmass: 4.2048 2.8337 4.5016 2.8336 4.6045 4.7144 3.1631 5.0732 3.1829 4.6330 3.5090 3.8301 1.8298 2.5372 2.3803 2.0604 4.4103 1.5077 1.4950 1.3503 2.0365 1.5448 3.4048 4.6074 5.7807 2.3691 2.3977 3.7502 2.2097 2.6196 2.0366 1.5319 3.0517 2.6492 3.0034 4.2226 6.3318 3.9408 1.3315 2.8721 1.8765 1.9205 6.0468 6.9997 3.2280 5.1268 1.6185 1.0945 3.7223 2.9168 1.5428 2.0771 2.5838 2.1218 1.4393 1.5706 2.4962 1.2225 1.3302 5.0340 5.2243 1.7902 2.3640 1.4018 1.5596 3.1970 2.0196 1.9654 2.6945 2.1932 1.9340 1.4638 2.4400 1.5223 1.2516 1.6644 2.5282 1.4884 2.2193 1.4581 1.1300 2.4493 2.1934 1.3963 1.3291 1.3227 1.3412 1.3120 1.2178 1.2561 1.3498 1.2238 4.1860 1.4004 2.1536 1.1173 1.1027 1.2167 1.0672 1.0405 1.0807 1.1053 1.1539 2.0518 1.0809 1.1107 1.0922 1.0625 2.1805 5.5500 6.0856 8.8332 1.0690 1.0354 1.0366 1.0552 1.0358 1.0357 1.0581 1.0852 1.1078 1.0986 1.0935 1.1068 1.0978 1.0995 1.0983 1.1004 1.0996 1.0986 1.1026 1.0876 1.0937 1.0953 1.0926 1.0738 1.0651 1.0761
irintensity: 0.1420 0.1360 0.5545 0.8443 0.3405 0.8426 0.6328 3.7012 1.0575 1.1592 1.5015 3.7143 6.2677 3.1290 4.3560 5.9590 1.3416 0.4930 1.5419 1.4703 1.5406 1.2520 2.8410 12.5859 1.1472 0.4889 0.6817 10.2648 1.6475 39.5164 33.1085 111.2029 7.4136 1.9472 8.9454 17.6793 1.6930 5.8508 26.9335 15.9711 60.0216 38.1660 39.9248 15.9102 1.9189 13.4291 86.0410 4.5786 9.2771 10.3534 0.3450 4.7195 7.6889 3.0945 42.4767 1.5384 4.8238 0.1991 1.8415 188.5662 25.0397 20.1643 65.0764 2.3617 40.9248 196.9977 41.8172 31.0576 26.2438 13.3640 13.5815 4.8787 137.8196 375.9947 74.6893 232.8305 56.3539 10.4554 34.1528 22.8024 0.0367 52.7461 9.8543 27.6132 3.0973 5.2123 10.6685 7.2638 20.8688 29.8438 47.9015 17.0376 7.7532 31.6745 142.0625 19.2067 2.9649 55.1485 8.7823 12.0137 6.0133 7.5794 0.9424 29.4824 2.7422 9.3323 33.0285 18.2721 557.5730 126.4824 193.7452 217.2586 58.2500 32.2959 44.0662 25.4485 11.4386 23.8499 23.6046 29.8001 20.5368 3.2929 13.7766 7.8491 76.9216 17.6548 65.4022 5.9246 71.2889 31.7860 46.4741 9.2527 23.7814 7.9186 9.8627 2.4563 16.7463 33.7331
temp: 298.150 k
press: 1.00000 atm
elementType: 8 8 8 8 7 7 6 6 6 6 6 6 6 6 6 6 6 6 6 6 6 6 1 1 1 1 1 1 1 1 1 1 1 1 1 1 1 1 1 1 1 1 1 1 1 1 1 1
symmnumber: 1
zpe: 1057973.2 jmol-1
zpe.correction: 0.402961 hartree
zpe.thermalcorrener: 0.427789 hartree
zpe.thermalcorrenthalpy: 0.428733 hartree
zpe.thermalcorrgfe: 0.345164 hartree
zpe.sumelectzpe: -1033.976680 hartree
zpe.sumelectthermal: -1033.951852 hartree
zpe.sumelectthermalent: -1033.950908 hartree
zpe.sumelectthermalfe: -1034.034477 hartree
dipole: 1.2622 0.2247 -3.3237
dipole: 3.5624
quadrupole: -101.5202 -124.9869 -142.9283
quadrupole: -2.5931 2.5353 -5.3895
quadrupole: 21.6249 -1.8418 -19.7832 -2.5931 2.5353 -5.3895
hfenergy: -1034.3796411 hartree
pointgroup: C01 [X(C16H26N2O4)]
dipole: -0.6444415 0.0700123 -1.2426351 debye
polarizability: 272.9222372|-14.9439146|182.5725903|-5.3573879|28.7826488|179.2023108 unknown
InChI: InChI=1S/C16H26N2O4/c1-5-21-15(20)18-12-7-6-8-14(9-12)22-11-13(19)10-17-16(2,3)4/h6-9,13,17-19H,5,10-11H2,1-4H3
charge 0 multiplicity 1
48 atoms
O  2.887643 -0.834343 2.725109
O  1.093809 -0.857694 0.619057
O  -5.417713 0.531482 0.576977
O  -3.281158 0.908455 1.49952
N  4.271969 0.929884 -0.309067
N  -3.676372 -0.631956 -0.264762
C  4.091807 2.172437 -1.132238
C  3.539513 0.809095 0.97137
C  3.367156 -0.685361 1.344175
C  5.096622 2.062803 -2.304849
C  2.64979 2.207046 -1.69772
C  4.376617 3.470754 -0.31926
C  2.440033 -1.417065 0.365826
C  0.015509 -1.331232 -0.143215
C  -1.234904 -0.755273 0.18208
C  0.139095 -2.304865 -1.164347
C  -2.384829 -1.162166 -0.530595
C  -1.025931 -2.696162 -1.86339
C  -2.281554 -2.139652 -1.561005
C  -4.028509 0.318247 0.680328
C  -5.977812 1.525824 1.535443
C  -7.469548 1.63144 1.235247
H  5.275701 0.735928 -0.177696
H  4.034559 1.311997 1.831187
H  2.536652 1.257268 0.859709
H  4.354848 -1.182928 1.33193
H  5.009839 2.933719 -2.978678
H  4.90513 1.144404 -2.887798
H  6.139624 2.027131 -1.932549
H  2.445998 1.286259 -2.272262
H  1.891847 2.284698 -0.89754
H  2.520271 3.07879 -2.364792
H  3.690097 3.557975 0.542641
H  5.41412 3.472641 0.066664
H  4.243477 4.370322 -0.948987
H  2.75863 -1.208075 -0.673055
H  2.428286 -2.505354 0.569338
H  1.913193 -0.641289 2.71445
H  -1.302587 -0.007907 0.974549
H  1.105033 -2.749006 -1.416489
H  -0.947928 -3.447999 -2.656289
H  -3.17445 -2.455655 -2.113311
H  -4.452042 -0.983762 -0.829761
H  -5.449528 2.486072 1.393964
H  -5.778986 1.171615 2.56332
H  -7.937329 2.358542 1.923728
H  -7.969417 0.656665 1.368093
H  -7.640573 1.973753 0.20025
