program: Orca
programVersion: 5.0.2
elementType: O O O O C C C C C C C C C C C C C C C C C C C C C C C C H H H H H H H H H H H H H H H H H H H H H H H H H H H H H H H H
charge: 0
multiplicity: 1
keywords: wb97x-d3
keywords: def2-TZVPP
keywords: def2/J RIJCOSX
keywords: DEFGRID2
keywords: scfconv7
keywords: smallprint printgap noloewdin
keywords: NOSOSCF
formula: C24H32O4
InChI: InChI=1/C24H32O4/c1-3-4-5-6-7-8-9-10-11-12-17-21-22(26)19-15-13-14-16-20(19)23(27)24(21)28-18(2)25/h13-16H,3-12,17H2,1-2H3
60 atoms
O  2.085668 -1.844859 -1.819694
O  2.55707 2.616677 -0.500174
O  -0.440517 -1.283523 -2.464047
O  0.858784 -2.858181 -0.247128
C  1.554218 -0.833987 2.858979
C  0.08409 -0.719368 3.254344
C  2.16481 0.468683 2.358503
C  -0.845636 -0.3454 2.104057
C  3.64368 0.363041 1.986136
C  -2.321482 -0.438374 2.470508
C  3.996168 -0.536484 0.800222
C  -3.241209 -0.0714 1.313502
C  3.798725 0.07243 -0.597835
C  -4.722528 -0.185976 1.647368
C  2.374338 0.327748 -0.979953
C  -5.627672 0.182729 0.47865
C  1.583269 -0.61737 -1.505661
C  1.827804 1.703849 -0.826218
C  0.385392 1.935181 -1.081327
C  -0.413977 0.919365 -1.609623
C  -7.107389 0.068473 0.811207
C  0.174762 -0.398461 -1.909908
C  -0.173258 3.176111 -0.802322
C  -1.760254 1.149883 -1.861818
C  -1.520854 3.397498 -1.042335
C  -2.312439 2.38799 -1.572821
C  1.584813 -2.939832 -1.196914
C  2.053806 -4.190757 -1.854689
H  1.649156 -1.610292 2.094567
H  2.130196 -1.1872 3.721124
H  -0.024511 0.011878 4.06358
H  -0.239113 -1.678962 3.671297
H  2.063584 1.228858 3.14051
H  1.579233 0.841777 1.516582
H  -0.628815 0.671045 1.759755
H  -0.646234 -1.002689 1.250639
H  4.04407 1.36465 1.801486
H  4.182489 -0.00994 2.862962
H  -2.547836 -1.456076 2.80759
H  -2.529139 0.216745 3.323965
H  3.46316 -1.488156 0.864765
H  5.057133 -0.788622 0.868984
H  -3.013643 -0.713922 0.45531
H  -3.022229 0.952045 0.989584
H  4.243557 -0.6061 -1.327959
H  4.361799 1.004016 -0.662366
H  -4.94596 -1.209035 1.970043
H  -4.954985 0.458307 2.502639
H  -5.395088 -0.460315 -0.376279
H  -5.405068 1.205131 0.156446
H  -7.38245 0.728752 1.63627
H  -7.732379 0.334942 -0.042816
H  -7.371662 -0.949509 1.105121
H  0.437043 3.969534 -0.392688
H  -2.38027 0.365338 -2.274255
H  -1.954623 4.36216 -0.814785
H  -3.362896 2.565165 -1.761106
H  1.904719 -5.042515 -1.196867
H  3.101732 -4.126755 -2.143307
H  1.471156 -4.349934 -2.764744
elementType: O C H
totalener: -1234.89566356 hartree
nucrepener: 2785.90337494 hartree
electener: -4020.79903850 hartree
oneelecener: -7218.37245558 hartree
twoeener: 3197.57341708 hartree
cpcmener: -0.02601534 hartree
kineticenergy: 1229.29230491 hartree
xcener: -121.321569301389 hartree
chargesum: 0.0000000
charge: -0.289310 -0.399413 -0.399232 -0.419947 -0.150420 -0.149683 -0.060115 -0.060084 -0.181909 -0.154786 -0.147190 -0.075390 -0.135363 -0.125187 -0.045897 -0.070598 0.181226 0.403339 -0.090242 -0.065044 -0.283272 0.353546 -0.102316 -0.092817 -0.099885 -0.159557 0.424540 -0.231820 0.061066 0.077362 0.063887 0.069228 0.082946 0.016433 0.052836 0.040021 0.079676 0.083002 0.058620 0.060825 0.078479 0.090623 0.058699 0.043875 0.101887 0.099858 0.056324 0.056200 0.056157 0.049428 0.077514 0.088982 0.077951 0.139950 0.140672 0.163234 0.162092 0.103828 0.114045 0.121124
qa: -0.2893 -0.3994 -0.3992 -0.4199 -0.1504 -0.1497 -0.0601 -0.0601 -0.1819 -0.1548 -0.1472 -0.0754 -0.1354 -0.1252 -0.0459 -0.0706 0.1812 0.4033 -0.0902 -0.0650 -0.2833 0.3535 -0.1023 -0.0928 -0.0999 -0.1596 0.4245 -0.2318 0.0611 0.0774 0.0639 0.0692 0.0829 0.0164 0.0528 0.0400 0.0797 0.0830 0.0586 0.0608 0.0785 0.0906 0.0587 0.0439 0.1019 0.0999 0.0563 0.0562 0.0562 0.0494 0.0775 0.0890 0.0780 0.1399 0.1407 0.1632 0.1621 0.1038 0.1140 0.1211
va: 2.1267 2.0865 2.0892 2.0820 3.8817 3.9303 3.8453 3.8544 3.9257 3.9717 3.8788 3.8805 3.8380 3.9002 3.6852 3.8669 3.7954 3.9006 3.6588 3.6168 3.9532 4.0264 3.9464 3.8457 3.9140 3.9017 4.0334 3.9180 1.0239 1.0155 1.0096 1.0098 1.0122 1.0308 1.0082 1.0285 1.0119 1.0063 1.0111 1.0085 1.0136 1.0075 1.0050 1.0117 1.0142 1.0260 1.0096 1.0086 1.0066 1.0077 1.0005 1.0042 1.0008 1.0227 1.0234 0.9890 0.9920 1.0130 1.0048 1.0010
dispcorr: -0.035449869 hartree
energy: -1234.931113425481
dipole: -22.22274 22.41276 0.19002 -5.91265 6.13097 0.21832 27.92979 -28.34727 -0.41748
magnitude: 0.50800 au
magnitude: 1.29122 debye
