program: Orca
programVersion: 5.0.2
elementType: O O O O C C C C C C C C C C C C C C C C C C C C C C C C H H H H H H H H H H H H H H H H H H H H H H H H H H H H H H H H
charge: 0
multiplicity: 1
keywords: wb97x-d3
keywords: def2-TZVPP
keywords: def2/J RIJCOSX
keywords: DEFGRID2
keywords: scfconv7
keywords: smallprint printgap noloewdin
keywords: NOSOSCF
formula: C24H32O4
InChI: InChI=1/C24H32O4/c1-3-4-5-6-7-8-9-10-11-12-17-21-22(26)19-15-13-14-16-20(19)23(27)24(21)28-18(2)25/h13-16H,3-12,17H2,1-2H3
60 atoms
O  1.930017 -2.09501 -1.022769
O  1.944376 2.576806 -0.647535
O  -0.574356 -1.930795 -1.895213
O  2.134418 -2.316156 -3.236933
C  1.561749 -1.342354 3.569111
C  0.317791 -1.425953 2.686364
C  2.284445 0.007982 3.55897
C  -0.75644 -0.385004 2.976289
C  2.532398 0.59544 2.171967
C  -1.969924 -0.528268 2.064884
C  3.38428 -0.281995 1.262158
C  -2.992822 0.587053 2.239068
C  3.409629 0.185568 -0.200841
C  -4.232102 0.400347 1.371628
C  2.03371 0.238599 -0.793035
C  -5.295953 1.479477 1.551796
C  1.371647 -0.861367 -1.17217
C  1.349307 1.553356 -0.912842
C  -0.060835 1.593394 -1.372223
C  -0.725327 0.421035 -1.737119
C  -4.853933 2.868104 1.113472
C  -0.034296 -0.876287 -1.639719
C  -0.729516 2.809561 -1.435736
C  -2.046693 0.469102 -2.162453
C  -2.049891 2.853105 -1.856649
C  -2.70719 1.685765 -2.221628
C  2.180346 -2.813404 -2.148411
C  2.501314 -4.228987 -1.817911
H  2.253742 -2.132062 3.262198
H  1.289315 -1.580058 4.602186
H  -0.116549 -2.425192 2.795046
H  0.608435 -1.350352 1.632996
H  3.235672 -0.101461 4.089759
H  1.70691 0.734056 4.13819
H  -1.072607 -0.461379 4.022706
H  -0.343958 0.622319 2.85988
H  1.562995 0.78736 1.703557
H  3.006792 1.575633 2.277587
H  -1.635961 -0.546712 1.020891
H  -2.448597 -1.497475 2.24388
H  3.032316 -1.314918 1.294954
H  4.413898 -0.302184 1.629841
H  -2.512651 1.543415 2.008654
H  -3.295225 0.644976 3.29112
H  4.0341 -0.493065 -0.784791
H  3.873885 1.169311 -0.266679
H  -3.934744 0.358294 0.317611
H  -4.67642 -0.574432 1.597252
H  -5.60784 1.509017 2.600771
H  -6.185768 1.195887 0.98253
H  -5.661248 3.593725 1.227045
H  -4.007288 3.235753 1.695088
H  -4.55544 2.873723 0.06254
H  -0.224484 3.722781 -1.151122
H  -2.56047 -0.440949 -2.44232
H  -2.568522 3.801677 -1.898073
H  -3.737699 1.722111 -2.548865
H  1.585471 -4.740425 -1.513931
H  3.203137 -4.294644 -0.987148
H  2.912856 -4.73739 -2.685303
elementType: O C H
totalener: -1234.89524563 hartree
nucrepener: 2790.12998906 hartree
electener: -4025.02523469 hartree
oneelecener: -7225.93034890 hartree
twoeener: 3200.90511421 hartree
cpcmener: -0.02770824 hartree
kineticenergy: 1229.29972830 hartree
xcener: -121.324851163729 hartree
chargesum: 0.0000000
charge: -0.299426 -0.400190 -0.400858 -0.409353 -0.176525 -0.050013 -0.171616 -0.174914 -0.079788 -0.072988 -0.172165 -0.135719 -0.131398 -0.119892 -0.020729 -0.103190 0.182673 0.358734 -0.060012 -0.100254 -0.278859 0.392826 -0.091749 -0.076229 -0.119544 -0.165934 0.397854 -0.233793 0.079497 0.075024 0.080639 0.014808 0.075207 0.081365 0.075102 0.066124 0.036285 0.088247 0.017262 0.071274 0.081342 0.085196 0.062640 0.064917 0.105912 0.099017 0.055717 0.075286 0.054686 0.068961 0.096800 0.082553 0.066709 0.139761 0.140557 0.165660 0.166297 0.121986 0.115802 0.102420
qa: -0.2994 -0.4002 -0.4009 -0.4094 -0.1765 -0.0500 -0.1716 -0.1749 -0.0798 -0.0730 -0.1722 -0.1357 -0.1314 -0.1199 -0.0207 -0.1032 0.1827 0.3587 -0.0600 -0.1003 -0.2789 0.3928 -0.0917 -0.0762 -0.1195 -0.1659 0.3979 -0.2338 0.0795 0.0750 0.0806 0.0148 0.0752 0.0814 0.0751 0.0661 0.0363 0.0882 0.0173 0.0713 0.0813 0.0852 0.0626 0.0649 0.1059 0.0990 0.0557 0.0753 0.0547 0.0690 0.0968 0.0826 0.0667 0.1398 0.1406 0.1657 0.1663 0.1220 0.1158 0.1024
va: 2.0872 2.0852 2.0870 2.0925 3.8985 3.8396 3.9164 3.8760 3.8224 3.8727 3.8842 3.8689 3.8497 3.8817 3.7454 3.8892 3.6780 3.9220 3.6985 3.6315 3.9307 3.9702 3.9293 3.8430 3.8757 3.8860 4.0970 3.9093 1.0025 1.0087 1.0116 1.0283 1.0091 1.0010 1.0128 1.0001 1.0193 1.0119 1.0277 1.0151 1.0119 1.0148 1.0056 1.0121 1.0129 1.0270 1.0132 1.0133 1.0091 1.0069 1.0064 0.9981 1.0044 1.0221 1.0235 0.9881 0.9890 1.0008 1.0030 1.0141
dispcorr: -0.035325356 hartree
energy: -1234.930570985424
dipole: -17.36068 16.89581 -0.46487 1.75696 -1.86629 -0.10933 35.48795 -34.49342 0.99453
magnitude: 1.10324 au
magnitude: 2.80422 debye
