program: Orca
programVersion: 5.0.2
elementType: O O O O C C C C C C C C C C C C C C C C C C C C C C C C H H H H H H H H H H H H H H H H H H H H H H H H H H H H H H H H
charge: 0
multiplicity: 1
keywords: wb97x-d3
keywords: def2-TZVPP
keywords: def2/J RIJCOSX
keywords: DEFGRID2
keywords: scfconv7
keywords: smallprint printgap noloewdin
keywords: NOSOSCF
formula: C24H32O4
InChI: InChI=1/C24H32O4/c1-3-4-5-6-7-8-9-10-11-12-17-21-22(26)19-15-13-14-16-20(19)23(27)24(21)28-18(2)25/h13-16H,3-12,17H2,1-2H3
60 atoms
O  2.099292 -1.910794 -1.866783
O  2.348961 2.592087 -0.654507
O  -0.462742 -1.520345 -2.421145
O  1.114211 -2.975407 -0.163838
C  1.043314 -0.019907 3.472642
C  0.305484 -1.329744 3.205285
C  1.825791 0.540885 2.2878
C  -0.770951 -1.257852 2.124251
C  3.058146 -0.28054 1.912303
C  -1.856441 -0.217388 2.376393
C  3.98654 0.400303 0.902931
C  -3.059284 -0.395593 1.457709
C  3.696232 0.11815 -0.580818
C  -4.07747 0.731329 1.558737
C  2.270162 0.276906 -1.000363
C  -5.296385 0.522311 0.669237
C  1.540889 -0.712175 -1.534515
C  1.656525 1.628577 -0.905337
C  0.1995 1.774768 -1.135502
C  -0.546374 0.705419 -1.633841
C  -6.284132 1.676994 0.729492
C  0.113797 -0.581885 -1.91516
C  -0.42457 2.986823 -0.869304
C  -1.906854 0.854867 -1.872564
C  -1.786231 3.125567 -1.090846
C  -2.525334 2.06385 -1.595836
C  1.728764 -3.026513 -1.190909
C  2.185461 -4.254317 -1.89907
H  1.73107 -0.166343 4.312212
H  0.326449 0.734054 3.810381
H  -0.160393 -1.659352 4.139834
H  1.022517 -2.112892 2.94039
H  2.152709 1.555549 2.535895
H  1.151243 0.648064 1.433258
H  -0.315626 -1.062056 1.149338
H  -1.234229 -2.246255 2.037612
H  3.626422 -0.46202 2.829802
H  2.768575 -1.269655 1.543765
H  -2.188077 -0.269806 3.419853
H  -1.444821 0.788274 2.239592
H  5.010965 0.061129 1.071492
H  3.997976 1.475914 1.088375
H  -3.546427 -1.350517 1.684132
H  -2.715171 -0.474697 0.420761
H  4.022084 -0.896082 -0.808104
H  4.317653 0.781432 -1.188933
H  -4.403574 0.840058 2.59933
H  -3.593948 1.678886 1.294565
H  -5.800596 -0.40541 0.957377
H  -4.96958 0.376108 -0.365607
H  -6.657703 1.829819 1.744148
H  -5.821574 2.612873 0.408269
H  -7.148096 1.501274 0.08641
H  0.147439 3.81958 -0.482523
H  -2.483302 0.02984 -2.269217
H  -2.272224 4.067223 -0.872414
H  -3.585898 2.178925 -1.775991
H  2.106264 -5.119697 -1.247057
H  3.210839 -4.153699 -2.252962
H  1.551703 -4.416208 -2.77354
elementType: O C H
totalener: -1234.89265974 hartree
nucrepener: 2821.08596521 hartree
electener: -4055.97862495 hartree
oneelecener: -7288.61469488 hartree
twoeener: 3232.63606993 hartree
cpcmener: -0.02679587 hartree
kineticenergy: 1229.29112687 hartree
xcener: -121.322622196391 hartree
chargesum: 0.0000000
charge: -0.290268 -0.394512 -0.401159 -0.418077 -0.165163 -0.173193 -0.054384 -0.040995 -0.130478 -0.141618 -0.154286 -0.132564 -0.160352 -0.130352 0.025967 -0.091801 0.177212 0.248994 0.026873 -0.121333 -0.280570 0.410891 -0.107586 -0.104881 -0.112024 -0.153317 0.422480 -0.232287 0.076398 0.083200 0.076678 0.078643 0.081277 -0.014916 -0.016252 0.081078 0.080708 0.065208 0.071127 0.058042 0.090830 0.080532 0.077633 0.056135 0.095639 0.108500 0.077826 0.053172 0.066653 0.049754 0.080652 0.075677 0.091067 0.141862 0.145382 0.163128 0.164812 0.102978 0.115389 0.119972
qa: -0.2903 -0.3945 -0.4012 -0.4181 -0.1652 -0.1732 -0.0544 -0.0410 -0.1305 -0.1416 -0.1543 -0.1326 -0.1604 -0.1304 0.0260 -0.0918 0.1772 0.2490 0.0269 -0.1213 -0.2806 0.4109 -0.1076 -0.1049 -0.1120 -0.1533 0.4225 -0.2323 0.0764 0.0832 0.0767 0.0786 0.0813 -0.0149 -0.0163 0.0811 0.0807 0.0652 0.0711 0.0580 0.0908 0.0805 0.0776 0.0561 0.0956 0.1085 0.0778 0.0532 0.0667 0.0498 0.0807 0.0757 0.0911 0.1419 0.1454 0.1631 0.1648 0.1030 0.1154 0.1200
va: 2.1264 2.0946 2.0868 2.0845 3.9157 3.9087 3.8294 3.8305 3.8551 3.8790 3.8775 3.8667 3.8714 3.8731 3.5775 3.8659 3.7976 4.0410 3.5793 3.6697 3.9449 3.9891 3.9463 3.8237 3.9066 3.8859 4.0397 3.9146 1.0111 1.0018 1.0095 1.0085 1.0151 1.0480 1.0338 1.0114 1.0089 1.0207 1.0146 1.0026 1.0067 1.0195 1.0135 1.0107 1.0183 1.0125 1.0102 1.0066 1.0089 1.0064 1.0014 1.0009 1.0041 1.0204 1.0229 0.9901 0.9855 1.0135 1.0040 1.0017
dispcorr: -0.037281937 hartree
energy: -1234.929941681813
dipole: -19.89656 19.94845 0.05189 -1.22415 1.46686 0.24272 28.58327 -29.02152 -0.43825
magnitude: 0.50366 au
magnitude: 1.28019 debye
