program: Orca
programVersion: 5.0.2
elementType: O O O O C C C C C C C C C C C C C C C C C C C C C C C C H H H H H H H H H H H H H H H H H H H H H H H H H H H H H H H H
charge: 0
multiplicity: 1
keywords: wb97x-d3
keywords: def2-TZVPP
keywords: def2/J RIJCOSX
keywords: DEFGRID2
keywords: scfconv7
keywords: smallprint printgap noloewdin
keywords: NOSOSCF
formula: C24H32O4
InChI: InChI=1/C24H32O4/c1-3-4-5-6-7-8-9-10-11-12-17-21-22(26)19-15-13-14-16-20(19)23(27)24(21)28-18(2)25/h13-16H,3-12,17H2,1-2H3
60 atoms
O  0.954485 -0.831963 -1.346429
O  4.104381 2.62995 -1.18979
O  -0.181282 0.45871 -3.385385
O  -0.928468 0.05211 -0.530354
C  -0.094155 -0.752257 2.942794
C  -0.505277 -2.182264 3.271345
C  1.313231 -0.653159 2.367106
C  -1.971349 -2.317671 3.664283
C  1.705796 0.766782 1.97678
C  -2.369109 -3.754284 3.982293
C  3.102211 0.888757 1.374412
C  -3.834736 -3.93717 4.368713
C  3.279166 0.233448 -0.004497
C  -4.822018 -3.667903 3.238373
C  2.512713 0.912582 -1.095991
C  -6.27091 -3.917385 3.638998
C  1.417888 0.406012 -1.678691
C  3.041228 2.211045 -1.596419
C  2.24791 2.981749 -2.583795
C  1.113362 2.420018 -3.170333
C  -7.252292 -3.668095 2.503634
C  0.700253 1.053815 -2.805434
C  2.642727 4.265511 -2.938419
C  0.379879 3.13968 -4.105026
C  1.898886 4.986982 -3.859449
C  0.77059 4.425714 -4.442196
C  -0.298231 -0.921615 -0.833272
C  -0.737419 -2.340183 -0.721972
H  -0.169048 -0.133163 3.843342
H  -0.806346 -0.328624 2.227497
H  0.129171 -2.570755 4.075605
H  -0.31119 -2.820524 2.401781
H  1.386101 -1.318313 1.500625
H  2.034701 -1.037809 3.096634
H  -2.180515 -1.683514 4.533155
H  -2.590088 -1.927734 2.849976
H  0.964191 1.180684 1.285651
H  1.66285 1.400656 2.868412
H  -2.142853 -4.39221 3.120119
H  -1.739286 -4.120663 4.799514
H  3.827715 0.427162 2.05057
H  3.379743 1.942843 1.313362
H  -4.069619 -3.290238 5.22144
H  -3.979455 -4.963245 4.722702
H  3.005771 -0.819738 0.045485
H  4.339246 0.259798 -0.265482
H  -4.724003 -2.635663 2.887772
H  -4.569676 -4.303383 2.3816
H  -6.527339 -3.277563 4.489274
H  -6.377982 -4.947638 3.993263
H  -8.281682 -3.852481 2.815514
H  -7.198008 -2.636684 2.149142
H  -7.047992 -4.318132 1.650304
H  3.523173 4.708175 -2.492703
H  -0.497651 2.702996 -4.562627
H  2.201715 5.991231 -4.124605
H  0.193884 4.992008 -5.161149
H  -1.09819 -2.670526 -1.698948
H  -1.555344 -2.428145 -0.012015
H  0.078096 -3.000611 -0.434267
elementType: O C H
totalener: -1234.90033465 hartree
nucrepener: 2579.23251973 hartree
electener: -3814.13285437 hartree
oneelecener: -6804.41973132 hartree
twoeener: 2990.28687694 hartree
cpcmener: -0.02656149 hartree
kineticenergy: 1229.28985398 hartree
xcener: -121.317865405312 hartree
chargesum: 0.0000000
charge: -0.283885 -0.405259 -0.394609 -0.411292 -0.137796 -0.147607 -0.138026 -0.117624 -0.125942 -0.122415 -0.156895 -0.135452 -0.146107 -0.107446 -0.052767 -0.087285 0.212104 0.398148 -0.102937 -0.066309 -0.275013 0.334032 -0.105089 -0.087549 -0.126787 -0.131483 0.415380 -0.260717 0.078963 0.059935 0.076488 0.056187 0.050762 0.082378 0.064820 0.060384 0.062574 0.085620 0.060449 0.072855 0.079235 0.092569 0.059368 0.071302 0.106484 0.105896 0.058877 0.055033 0.054666 0.054130 0.089330 0.076765 0.076689 0.141522 0.142130 0.162486 0.162865 0.140627 0.106084 0.119154
qa: -0.2839 -0.4053 -0.3946 -0.4113 -0.1378 -0.1476 -0.1380 -0.1176 -0.1259 -0.1224 -0.1569 -0.1355 -0.1461 -0.1074 -0.0528 -0.0873 0.2121 0.3981 -0.1029 -0.0663 -0.2750 0.3340 -0.1051 -0.0875 -0.1268 -0.1315 0.4154 -0.2607 0.0790 0.0599 0.0765 0.0562 0.0508 0.0824 0.0648 0.0604 0.0626 0.0856 0.0604 0.0729 0.0792 0.0926 0.0594 0.0713 0.1065 0.1059 0.0589 0.0550 0.0547 0.0541 0.0893 0.0768 0.0767 0.1415 0.1421 0.1625 0.1629 0.1406 0.1061 0.1192
va: 2.1254 2.0825 2.0946 2.0731 3.8535 3.8880 3.8496 3.8655 3.8422 3.8998 3.9108 3.9050 3.8429 3.8599 3.7263 3.8835 3.7335 3.9732 3.7603 3.7075 3.9451 4.1039 3.9472 3.9234 3.9346 3.9348 4.0075 3.9144 1.0125 1.0164 1.0126 1.0073 1.0104 1.0098 1.0114 1.0092 1.0235 1.0092 1.0087 1.0111 1.0113 1.0167 1.0095 1.0103 1.0098 1.0189 1.0086 1.0089 1.0065 1.0079 1.0043 1.0017 1.0011 1.0216 1.0190 0.9906 0.9906 1.0016 1.0056 1.0048
dispcorr: -0.029971580 hartree
energy: -1234.930306225334
dipole: -36.61094 36.90841 0.29747 -37.66331 37.54468 -0.11862 49.01352 -49.18575 -0.17223
magnitude: 0.36362 au
magnitude: 0.92425 debye
