program: Orca
programVersion: 5.0.2
elementType: O O O O C C C C C C C C C C C C C C C C C C C C C C C C H H H H H H H H H H H H H H H H H H H H H H H H H H H H H H H H
charge: 0
multiplicity: 1
keywords: wb97x-d3
keywords: def2-TZVPP
keywords: def2/J RIJCOSX
keywords: DEFGRID2
keywords: scfconv7
keywords: smallprint printgap noloewdin
keywords: NOSOSCF
formula: C24H32O4
InChI: InChI=1/C24H32O4/c1-3-4-5-6-7-8-9-10-11-12-17-21-22(26)19-15-13-14-16-20(19)23(27)24(21)28-18(2)25/h13-16H,3-12,17H2,1-2H3
60 atoms
O  1.547831 -1.781661 -1.974208
O  1.645951 -0.428437 2.512918
O  -1.07972 -2.086267 -1.732263
O  1.39059 -3.982529 -1.62895
C  1.8364 3.461727 0.798138
C  0.464824 2.908582 1.175001
C  2.890233 2.374649 0.58908
C  -0.623486 3.973602 1.218987
C  2.704263 1.612859 -0.720177
C  -1.981828 3.453163 1.685068
C  3.533005 0.339754 -0.851994
C  -2.564682 2.310055 0.856298
C  3.172068 -0.783497 0.136776
C  -2.7901 2.645898 -0.612053
C  1.700989 -1.057248 0.251323
C  -3.411436 1.49674 -1.397214
C  0.972039 -1.536717 -0.763692
C  1.011808 -0.786453 1.542969
C  -0.454484 -0.990047 1.637497
C  -1.183188 -1.454471 0.541748
C  -3.693444 1.853792 -2.84841
C  -0.495421 -1.735563 -0.729802
C  -1.109824 -0.711394 2.830443
C  -2.556373 -1.639508 0.643382
C  -2.480214 -0.896959 2.927652
C  -3.202771 -1.361771 1.837021
C  1.659216 -3.07711 -2.364549
C  2.148873 -3.169959 -3.768201
H  2.16851 4.148433 1.582695
H  1.751411 4.065224 -0.113026
H  0.53396 2.418268 2.152786
H  0.176569 2.125691 0.466762
H  2.864915 1.691215 1.441558
H  3.889102 2.820168 0.597314
H  -0.311069 4.7802 1.890529
H  -0.71946 4.43388 0.23027
H  1.648594 1.36588 -0.868461
H  2.962718 2.279129 -1.548606
H  -1.895607 3.121367 2.725247
H  -2.694525 4.284428 1.694615
H  4.592517 0.569689 -0.709811
H  3.443315 -0.031837 -1.873511
H  -3.519271 2.012848 1.302683
H  -1.91942 1.429314 0.929428
H  3.562508 -0.545026 1.124118
H  3.681166 -1.699374 -0.173937
H  -3.435347 3.528982 -0.687513
H  -1.842359 2.923652 -1.085209
H  -4.340834 1.183605 -0.910504
H  -2.7445 0.629475 -1.360122
H  -4.128186 1.013639 -3.39245
H  -4.393001 2.689148 -2.922866
H  -2.7800 2.143963 -3.371802
H  -0.554409 -0.346568 3.683894
H  -3.120074 -2.002348 -0.205697
H  -2.986447 -0.675745 3.858017
H  -4.271833 -1.50673 1.916444
H  1.368736 -2.82198 -4.448699
H  2.397166 -4.198048 -4.015879
H  3.022517 -2.536454 -3.922749
elementType: O C H
totalener: -1234.89447659 hartree
nucrepener: 2815.47630338 hartree
electener: -4050.37077997 hartree
oneelecener: -7276.82062485 hartree
twoeener: 3226.44984489 hartree
cpcmener: -0.02684371 hartree
kineticenergy: 1229.30413836 hartree
xcener: -121.326033090860 hartree
chargesum: -0.0000000
charge: -0.293564 -0.400850 -0.402239 -0.411330 -0.143752 -0.082929 -0.144717 -0.150898 -0.124582 -0.152653 -0.162327 -0.048554 -0.177027 -0.135461 0.016892 -0.055806 0.175260 0.301634 -0.046148 -0.045396 -0.284899 0.393725 -0.096730 -0.127932 -0.132692 -0.111578 0.405988 -0.232981 0.075918 0.061343 0.058855 0.030700 0.070801 0.080935 0.075092 0.068795 0.071732 0.083796 0.072922 0.076659 0.082741 0.089542 0.083593 -0.032199 0.105241 0.110388 0.064253 0.061037 0.056461 0.031302 0.090565 0.079944 0.077968 0.138612 0.142284 0.161289 0.160648 0.121523 0.102064 0.116744
qa: -0.2936 -0.4009 -0.4022 -0.4113 -0.1438 -0.0829 -0.1447 -0.1509 -0.1246 -0.1527 -0.1623 -0.0486 -0.1770 -0.1355 0.0169 -0.0558 0.1753 0.3016 -0.0461 -0.0454 -0.2849 0.3937 -0.0967 -0.1279 -0.1327 -0.1116 0.4060 -0.2330 0.0759 0.0613 0.0589 0.0307 0.0708 0.0809 0.0751 0.0688 0.0717 0.0838 0.0729 0.0767 0.0827 0.0895 0.0836 -0.0322 0.1052 0.1104 0.0643 0.0610 0.0565 0.0313 0.0906 0.0799 0.0780 0.1386 0.1423 0.1613 0.1606 0.1215 0.1021 0.1167
va: 2.1110 2.0733 2.0851 2.0916 3.9340 3.8411 3.8589 3.8964 3.8584 3.9147 3.8942 3.8490 3.8498 3.8803 3.7067 3.8671 3.7532 3.9214 3.6594 3.6020 3.9600 4.0037 3.8630 3.8790 3.9181 3.8832 4.0795 3.9087 1.0097 1.0075 1.0147 1.0012 1.0193 1.0125 1.0116 1.0021 1.0023 1.0093 1.0102 1.0084 1.0104 1.0154 1.0075 1.0353 1.0191 1.0090 1.0101 1.0025 1.0082 1.0122 1.0039 1.0013 1.0005 1.0241 1.0225 0.9903 0.9911 1.0011 1.0145 1.0011
dispcorr: -0.036538682 hartree
energy: -1234.931015274870
dipole: -6.67447 6.54562 -0.12885 37.21208 -36.37480 0.83728 -6.01408 5.78539 -0.22869
magnitude: 0.87746 au
magnitude: 2.23034 debye
