program: Orca
programVersion: 5.0.2
elementType: O O O O C C C C C C C C C C C C C C C C C C C C C C C C H H H H H H H H H H H H H H H H H H H H H H H H H H H H H H H H
charge: 0
multiplicity: 1
keywords: wb97x-d3
keywords: def2-TZVPP
keywords: def2/J RIJCOSX
keywords: DEFGRID2
keywords: scfconv7
keywords: smallprint printgap noloewdin
keywords: NOSOSCF
formula: C24H32O4
InChI: InChI=1/C24H32O4/c1-3-4-5-6-7-8-9-10-11-12-17-21-22(26)19-15-13-14-16-20(19)23(27)24(21)28-18(2)25/h13-16H,3-12,17H2,1-2H3
60 atoms
O  2.39423 -2.198453 -1.52132
O  1.87136 2.265529 -0.202236
O  -0.172521 -2.193561 -2.250471
O  2.506814 -1.965458 -3.741817
C  1.122181 0.21406 3.55579
C  -0.31509 -0.244503 3.787748
C  1.777022 -0.408698 2.330399
C  -1.314626 0.270281 2.756928
C  3.215727 0.055074 2.124899
C  -2.741584 -0.173392 3.057356
C  3.93089 -0.568791 0.926351
C  -3.787143 0.304438 2.05328
C  3.666706 0.090997 -0.436139
C  -3.967046 1.818323 2.014182
C  2.237626 0.050801 -0.878611
C  -5.105182 2.287122 1.111004
C  1.678504 -1.042837 -1.409996
C  1.391154 1.25693 -0.675164
C  -0.040302 1.202604 -1.056618
C  -0.585302 0.045494 -1.616516
C  -6.492069 1.898476 1.604096
C  0.257844 -1.149393 -1.810036
C  -0.844763 2.31854 -0.86173
C  -1.925094 0.012645 -1.982021
C  -2.180251 2.282356 -1.231023
C  -2.71923 1.132411 -1.791956
C  2.703507 -2.635944 -2.768513
C  3.30053 -3.999609 -2.719511
H  1.722819 -0.026621 4.438855
H  1.14404 1.305979 3.465257
H  -0.63727 0.086875 4.779791
H  -0.346681 -1.33943 3.812614
H  1.168459 -0.191006 1.45158
H  1.765855 -1.499654 2.430087
H  -1.25655 1.36318 2.728332
H  -1.040521 -0.074308 1.754218
H  3.250816 1.146721 2.050837
H  3.781585 -0.195837 3.02744
H  -2.766945 -1.26704 3.098483
H  -3.024184 0.170609 4.058612
H  3.692905 -1.633899 0.871275
H  5.009231 -0.510953 1.087625
H  -4.740523 -0.171853 2.30022
H  -3.523557 -0.053843 1.051167
H  4.285806 -0.405222 -1.186409
H  4.001957 1.127283 -0.398769
H  -4.14121 2.189517 3.031082
H  -3.037844 2.288414 1.679415
H  -4.955138 1.89276 0.100868
H  -5.056285 3.375905 1.019215
H  -7.269677 2.319851 0.965062
H  -6.639122 0.818002 1.617113
H  -6.668646 2.265751 2.617292
H  -0.429446 3.216578 -0.424695
H  -2.346353 -0.883243 -2.418242
H  -2.801622 3.155562 -1.083215
H  -3.760763 1.107908 -2.083327
H  4.090107 -4.056248 -1.970964
H  3.700577 -4.273405 -3.691686
H  2.531178 -4.720735 -2.438797
elementType: O C H
totalener: -1234.89427166 hartree
nucrepener: 2745.38582765 hartree
electener: -3980.28009932 hartree
oneelecener: -7136.54518267 hartree
twoeener: 3156.26508336 hartree
cpcmener: -0.02730431 hartree
kineticenergy: 1229.31024673 hartree
xcener: -121.325061041990 hartree
chargesum: -0.0000000
charge: -0.292125 -0.399164 -0.398137 -0.412791 -0.123850 -0.145255 -0.064216 -0.090091 -0.153934 -0.147336 -0.135592 -0.129817 -0.150639 -0.138168 -0.082442 -0.113578 0.236330 0.418927 -0.106941 -0.077120 -0.276244 0.368611 -0.111668 -0.066276 -0.135730 -0.152228 0.405864 -0.232097 0.075179 0.060552 0.073162 0.061422 -0.011381 0.071984 0.068404 0.040600 0.069197 0.082790 0.071787 0.062876 0.075344 0.089459 0.085135 0.056997 0.105459 0.097779 0.077874 0.072872 0.045227 0.074244 0.090367 0.078528 0.080952 0.135729 0.139076 0.169260 0.165931 0.116311 0.101787 0.120806
qa: -0.2921 -0.3992 -0.3981 -0.4128 -0.1239 -0.1453 -0.0642 -0.0901 -0.1539 -0.1473 -0.1356 -0.1298 -0.1506 -0.1382 -0.0824 -0.1136 0.2363 0.4189 -0.1069 -0.0771 -0.2762 0.3686 -0.1117 -0.0663 -0.1357 -0.1522 0.4059 -0.2321 0.0752 0.0606 0.0732 0.0614 -0.0114 0.0720 0.0684 0.0406 0.0692 0.0828 0.0718 0.0629 0.0753 0.0895 0.0851 0.0570 0.1055 0.0978 0.0779 0.0729 0.0452 0.0742 0.0904 0.0785 0.0810 0.1357 0.1391 0.1693 0.1659 0.1163 0.1018 0.1208
va: 2.1097 2.0811 2.0971 2.0877 3.9033 3.9429 3.8170 3.8479 3.8789 3.9275 3.8958 3.8624 3.8677 3.8493 3.7898 3.8866 3.6653 3.8376 3.6834 3.6577 3.9437 4.0653 3.9068 3.8863 3.8692 3.8926 4.0813 3.9074 1.0110 1.0117 1.0096 1.0098 1.0527 1.0159 1.0060 1.0105 1.0149 1.0078 1.0088 1.0102 1.0158 1.0066 1.0120 1.0126 1.0120 1.0251 1.0102 1.0070 1.0110 1.0045 1.0043 1.0000 1.0009 1.0260 1.0214 0.9853 0.9899 1.0022 1.0142 1.0015
dispcorr: -0.034420585 hartree
energy: -1234.928692249750
dipole: -22.71245 22.46776 -0.24470 5.95583 -6.16321 -0.20739 36.25727 -35.32666 0.93061
magnitude: 0.98433 au
magnitude: 2.50198 debye
