program: Orca
programVersion: 5.0.2
elementType: O O O O C C C C C C C C C C C C C C C C C C C C C C C C H H H H H H H H H H H H H H H H H H H H H H H H H H H H H H H H
charge: 0
multiplicity: 1
keywords: wb97x-d3
keywords: def2-TZVPP
keywords: def2/J RIJCOSX
keywords: DEFGRID2
keywords: scfconv7
keywords: smallprint printgap noloewdin
keywords: NOSOSCF
formula: C24H32O4
InChI: InChI=1/C24H32O4/c1-3-4-5-6-7-8-9-10-11-12-17-21-22(26)19-15-13-14-16-20(19)23(27)24(21)28-18(2)25/h13-16H,3-12,17H2,1-2H3
60 atoms
O  1.409707 -1.619401 1.958832
O  2.744078 2.492535 0.148023
O  -0.876965 -0.446941 2.620333
O  -0.095555 -2.44059 0.520287
C  0.934049 -0.180834 -2.419071
C  -0.078047 -0.021902 -3.547494
C  2.08633 -1.109055 -2.787137
C  -1.208925 0.959727 -3.245633
C  2.967875 -1.508132 -1.606748
C  -1.983009 0.682068 -1.959227
C  3.74752 -0.352894 -0.956696
C  -2.611779 -0.70355 -1.87444
C  3.494374 -0.173059 0.548353
C  -3.375622 -0.921206 -0.574037
C  2.136405 0.354081 0.892729
C  -3.979532 -2.313389 -0.444933
C  1.183965 -0.347223 1.521694
C  1.857105 1.780053 0.568801
C  0.485087 2.308657 0.758851
C  -0.47492 1.554012 1.43333
C  -4.710991 -2.518315 0.873174
C  -0.132934 0.2084 1.923324
C  0.154319 3.566167 0.270195
C  -1.753637 2.061273 1.627778
C  -1.1290 4.060553 0.447599
C  -2.079912 3.312254 1.129065
C  0.6248 -2.609603 1.463892
C  0.793864 -3.867649 2.241537
H  0.432804 -0.577875 -1.53211
H  1.321508 0.804201 -2.136719
H  -0.495215 -1.005041 -3.788512
H  0.438395 0.308765 -4.454664
H  2.699006 -0.645345 -3.568022
H  1.674586 -2.021286 -3.23138
H  -0.796947 1.972669 -3.190222
H  -1.904552 0.964479 -4.091221
H  2.340716 -2.007962 -0.863648
H  3.674786 -2.269961 -1.944192
H  -1.325182 0.825998 -1.097128
H  -2.769176 1.437469 -1.856812
H  3.552848 0.584533 -1.480836
H  4.819191 -0.526874 -1.070439
H  -1.835775 -1.471416 -1.959741
H  -3.28397 -0.855938 -2.726714
H  4.235349 0.523022 0.948685
H  3.665333 -1.124062 1.052607
H  -2.701239 -0.746857 0.271589
H  -4.169571 -0.170927 -0.48524
H  -3.185088 -3.06061 -0.539227
H  -4.666834 -2.493028 -1.277717
H  -5.527047 -1.802232 0.99236
H  -5.141724 -3.518431 0.944938
H  -4.036915 -2.390429 1.723017
H  0.893212 4.156925 -0.254454
H  -2.495785 1.477174 2.155247
H  -1.386853 5.035128 0.054753
H  -3.079056 3.702855 1.268752
H  0.217892 -3.788883 3.16651
H  1.834077 -4.035454 2.51632
H  0.420872 -4.715975 1.674282
elementType: O C H
totalener: -1234.89366928 hartree
nucrepener: 2861.88069995 hartree
electener: -4096.77436923 hartree
oneelecener: -7370.52164753 hartree
twoeener: 3273.74727830 hartree
cpcmener: -0.02582763 hartree
kineticenergy: 1229.28121744 hartree
xcener: -121.320738780359 hartree
chargesum: -0.0000000
charge: -0.288845 -0.401862 -0.394921 -0.420137 -0.046950 -0.142976 -0.160901 -0.177570 -0.119283 -0.016341 -0.166884 -0.155851 -0.131125 -0.090961 -0.045830 -0.085569 0.237128 0.319879 -0.044444 -0.012255 -0.279276 0.315338 -0.117439 -0.113311 -0.113845 -0.128253 0.432478 -0.236025 -0.002586 0.063487 0.070429 0.074242 0.071603 0.066222 0.072372 0.076330 0.053677 0.088078 -0.034956 0.082451 0.083629 0.091954 0.059937 0.071997 0.102925 0.099030 0.023994 0.069714 0.052414 0.058833 0.076554 0.089604 0.077238 0.139830 0.140791 0.162261 0.162856 0.121914 0.114339 0.104868
qa: -0.2888 -0.4019 -0.3949 -0.4201 -0.0470 -0.1430 -0.1609 -0.1776 -0.1193 -0.0163 -0.1669 -0.1559 -0.1311 -0.0910 -0.0458 -0.0856 0.2371 0.3199 -0.0444 -0.0123 -0.2793 0.3153 -0.1174 -0.1133 -0.1138 -0.1283 0.4325 -0.2360 -0.0026 0.0635 0.0704 0.0742 0.0716 0.0662 0.0724 0.0763 0.0537 0.0881 -0.0350 0.0825 0.0836 0.0920 0.0599 0.0720 0.1029 0.0990 0.0240 0.0697 0.0524 0.0588 0.0766 0.0896 0.0772 0.1398 0.1408 0.1623 0.1629 0.1219 0.1143 0.1049
va: 2.1303 2.0838 2.0867 2.0672 3.8111 3.9046 3.9370 3.9398 3.8251 3.8086 3.8658 3.8917 3.8657 3.8704 3.6513 3.8836 3.7005 3.9608 3.6388 3.5642 3.9446 4.0814 3.9369 3.8889 3.9246 3.9194 4.0120 3.9243 1.0287 1.0169 1.0017 1.0108 1.0087 1.0100 1.0092 1.0082 1.0318 1.0081 1.0539 1.0102 1.0164 1.0073 1.0052 1.0128 1.0167 1.0168 1.0113 1.0117 1.0114 1.0087 1.0009 1.0047 1.0030 1.0213 1.0194 0.9898 0.9904 1.0008 1.0050 1.0124
dispcorr: -0.037874211 hartree
energy: -1234.931543489369
dipole: -15.31416 15.51832 0.20416 -16.45675 16.62919 0.17244 -24.29328 24.59078 0.29751
magnitude: 0.39991 au
magnitude: 1.01649 debye
