program: Orca
programVersion: 5.0.2
elementType: O O O O C C C C C C C C C C C C C C C C C C C C C C C C H H H H H H H H H H H H H H H H H H H H H H H H H H H H H H H H
charge: 0
multiplicity: 1
keywords: wb97x-d3
keywords: def2-TZVPP
keywords: def2/J RIJCOSX
keywords: DEFGRID2
keywords: scfconv7
keywords: smallprint printgap noloewdin
keywords: NOSOSCF
formula: C24H32O4
InChI: InChI=1/C24H32O4/c1-3-4-5-6-7-8-9-10-11-12-17-21-22(26)19-15-13-14-16-20(19)23(27)24(21)28-18(2)25/h13-16H,3-12,17H2,1-2H3
60 atoms
O  1.596751 1.11442 2.471282
O  2.217414 1.245507 -2.176402
O  -0.800579 2.192402 2.087755
O  0.215814 -0.635093 2.66198
C  1.739844 -4.074417 -1.42167
C  0.448528 -3.485948 -1.986779
C  2.379526 -3.271011 -0.291239
C  -0.636903 -3.208229 -0.953797
C  2.596405 -1.800584 -0.62152
C  -1.93301 -2.718039 -1.592517
C  3.288596 -1.048481 0.506894
C  -2.973387 -2.21162 -0.595522
C  3.342837 0.472137 0.309124
C  -2.616684 -0.858399 0.012918
C  1.984401 1.086117 0.152902
C  -3.625633 -0.339094 1.032925
C  1.178109 1.335183 1.19176
C  1.499541 1.419225 -1.214433
C  0.122546 1.944549 -1.382092
C  -0.675727 2.219862 -0.271177
C  -4.98528 0.004354 0.441608
C  -0.167996 1.945476 1.083701
C  -0.374861 2.171843 -2.65954
C  -1.954904 2.735158 -0.4396
C  -1.657389 2.671721 -2.823868
C  -2.444706 2.957678 -1.716492
C  0.969374 0.140865 3.178822
C  1.348174 0.194147 4.617512
H  2.460145 -4.177764 -2.239463
H  1.545874 -5.089963 -1.062136
H  0.056727 -4.174144 -2.74312
H  0.669275 -2.55755 -2.523842
H  3.336215 -3.734235 -0.029038
H  1.760542 -3.339854 0.60925
H  -0.839949 -4.116198 -0.374779
H  -0.278135 -2.467418 -0.232829
H  3.177435 -1.701839 -1.544549
H  1.623768 -1.342723 -0.822317
H  -1.705749 -1.915646 -2.304407
H  -2.361415 -3.531369 -2.186519
H  4.314978 -1.409167 0.61658
H  2.789299 -1.27632 1.452036
H  -3.107862 -2.950238 0.203217
H  -3.93943 -2.13803 -1.102883
H  3.945422 0.703678 -0.568997
H  3.849826 0.925861 1.162501
H  -1.635848 -0.916183 0.492917
H  -2.512195 -0.125782 -0.795426
H  -3.213896 0.551813 1.51555
H  -3.749083 -1.078388 1.830869
H  -5.651728 0.42253 1.19796
H  -4.893173 0.74507 -0.356622
H  -5.48614 -0.868853 0.021189
H  0.236932 1.958272 -3.525587
H  -2.569244 2.953626 0.423487
H  -2.042275 2.84208 -3.820588
H  -3.443225 3.352628 -1.848291
H  0.84205 1.039764 5.087633
H  2.419679 0.343307 4.742691
H  1.043388 -0.71804 5.122678
elementType: O C H
totalener: -1234.89641391 hartree
nucrepener: 2826.59803235 hartree
electener: -4061.49444626 hartree
oneelecener: -7299.86698201 hartree
twoeener: 3238.37253575 hartree
cpcmener: -0.02618268 hartree
kineticenergy: 1229.29912969 hartree
xcener: -121.324353038418 hartree
chargesum: -0.0000000
charge: -0.291695 -0.401183 -0.397677 -0.421299 -0.180157 -0.121996 -0.123269 -0.127728 -0.120576 -0.123539 -0.149631 -0.129839 -0.126598 -0.069687 -0.052331 -0.117342 0.192631 0.388998 -0.056220 -0.067080 -0.277329 0.336644 -0.113381 -0.116018 -0.114287 -0.124548 0.425055 -0.233908 0.073756 0.073327 0.077593 0.065283 0.077676 0.068625 0.072838 0.043785 0.083089 0.038286 0.055872 0.079212 0.089641 0.074362 0.060524 0.076810 0.099010 0.106058 0.035278 0.033343 0.062401 0.067304 0.092247 0.074001 0.082662 0.139251 0.143556 0.163738 0.163444 0.122205 0.115146 0.103663
qa: -0.2917 -0.4012 -0.3977 -0.4213 -0.1802 -0.1220 -0.1233 -0.1277 -0.1206 -0.1235 -0.1496 -0.1298 -0.1266 -0.0697 -0.0523 -0.1173 0.1926 0.3890 -0.0562 -0.0671 -0.2773 0.3366 -0.1134 -0.1160 -0.1143 -0.1245 0.4251 -0.2339 0.0738 0.0733 0.0776 0.0653 0.0777 0.0686 0.0728 0.0438 0.0831 0.0383 0.0559 0.0792 0.0896 0.0744 0.0605 0.0768 0.0990 0.1061 0.0353 0.0333 0.0624 0.0673 0.0922 0.0740 0.0827 0.1393 0.1436 0.1637 0.1634 0.1222 0.1151 0.1037
va: 2.1277 2.0826 2.0844 2.0757 3.9260 3.8531 3.8724 3.8525 3.8404 3.9040 3.8973 3.9223 3.8417 3.8692 3.7148 3.8836 3.7910 3.9051 3.6980 3.6015 3.9308 4.0455 3.9482 3.8700 3.9285 3.9178 4.0271 3.9199 1.0072 1.0087 1.0098 1.0037 1.0108 1.0045 1.0140 1.0030 1.0138 1.0100 1.0113 1.0094 1.0144 1.0159 1.0088 1.0068 1.0265 1.0132 1.0222 1.0120 1.0132 1.0103 1.0046 1.0002 1.0002 1.0232 1.0169 0.9893 0.9903 1.0009 1.0040 1.0132
dispcorr: -0.036027850 hartree
energy: -1234.932441755424
dipole: -12.51430 12.73682 0.22252 -32.26845 32.84680 0.57835 -4.22174 4.27159 0.04985
magnitude: 0.62168 au
magnitude: 1.58018 debye
