program: Orca
programVersion: 5.0.2
elementType: O O O O C C C C C C C C C C C C C C C C C C C C C C C C H H H H H H H H H H H H H H H H H H H H H H H H H H H H H H H H
charge: 0
multiplicity: 1
keywords: wb97x-d3
keywords: def2-TZVPP
keywords: def2/J RIJCOSX
keywords: DEFGRID2
keywords: scfconv7
keywords: smallprint printgap noloewdin
keywords: NOSOSCF
formula: C24H32O4
InChI: InChI=1/C24H32O4/c1-3-4-5-6-7-8-9-10-11-12-17-21-22(26)19-15-13-14-16-20(19)23(27)24(21)28-18(2)25/h13-16H,3-12,17H2,1-2H3
60 atoms
O  1.965872 -1.820089 -1.899559
O  2.155706 2.595516 -0.349677
O  -0.49746 -1.28076 -2.767056
O  0.579053 -2.899812 -0.515317
C  1.611164 -0.050594 3.525838
C  0.341579 -0.174631 2.69169
C  2.685458 -1.082394 3.172645
C  -0.762853 0.789523 3.109716
C  3.010418 -1.177083 1.683014
C  -1.954048 0.796931 2.153727
C  3.578017 0.106553 1.08782
C  -2.768422 -0.493496 2.159108
C  3.513037 0.151183 -0.446561
C  -3.785298 -0.591303 1.025803
C  2.115773 0.329806 -0.953374
C  -4.841973 0.50623 1.014277
C  1.406968 -0.618068 -1.581073
C  1.49194 1.669093 -0.764939
C  0.055877 1.8475 -1.084474
C  -0.653992 0.833889 -1.729121
C  -5.866711 0.314868 -0.093574
C  0.025804 -0.422921 -2.090061
C  -0.585931 3.032006 -0.745471
C  -1.9982 1.008338 -2.033647
C  -1.931568 3.195883 -1.036912
C  -2.63638 2.187222 -1.680473
C  1.414043 -2.943271 -1.373671
C  1.98447 -4.164359 -2.006708
H  1.362106 -0.159573 4.586344
H  2.010352 0.963362 3.422225
H  -0.017231 -1.208015 2.737608
H  0.574206 0.014227 1.638042
H  2.353446 -2.068046 3.513208
H  3.596206 -0.860076 3.738145
H  -1.101561 0.55468 4.125147
H  -0.345259 1.800739 3.158042
H  3.722038 -1.991986 1.52045
H  2.104755 -1.46935 1.148367
H  -2.604634 1.640503 2.400948
H  -1.587403 0.988448 1.138614
H  4.623675 0.215898 1.386731
H  3.062619 0.977769 1.495397
H  -3.27919 -0.594966 3.123367
H  -2.097029 -1.353545 2.085061
H  3.953992 -0.756414 -0.859145
H  4.120402 0.983619 -0.808347
H  -3.252285 -0.584914 0.068181
H  -4.285894 -1.5637 1.082477
H  -4.366466 1.484178 0.897097
H  -5.351268 0.531942 1.983416
H  -5.392233 0.299039 -1.077434
H  -6.406238 -0.62769 0.021495
H  -6.607083 1.116537 -0.10045
H  -0.041558 3.8225 -0.246431
H  -2.548235 0.225311 -2.53825
H  -2.432348 4.114464 -0.76102
H  -3.685598 2.320016 -1.90917
H  1.549046 -4.285602 -3.001171
H  1.746389 -5.043718 -1.414613
H  3.063923 -4.085047 -2.129763
elementType: O C H
totalener: -1234.89511883 hartree
nucrepener: 2826.06007563 hartree
electener: -4060.95519447 hartree
oneelecener: -7298.36560670 hartree
twoeener: 3237.41041223 hartree
cpcmener: -0.02685318 hartree
kineticenergy: 1229.28766277 hartree
xcener: -121.324517827614 hartree
chargesum: -0.0000000
charge: -0.288111 -0.403356 -0.396752 -0.416160 -0.137745 -0.069651 -0.181341 -0.153486 -0.071911 -0.017942 -0.181343 -0.150226 -0.117517 -0.139913 -0.071650 -0.094745 0.238108 0.374908 -0.104916 0.001250 -0.281842 0.338566 -0.090960 -0.137615 -0.129642 -0.124094 0.426200 -0.238827 0.072759 0.068732 0.079803 -0.009580 0.075095 0.072948 0.067469 0.071065 0.087210 0.027609 0.088318 -0.055349 0.086522 0.083836 0.064922 0.078747 0.093059 0.107216 0.058994 0.078138 0.056763 0.069444 0.070297 0.084379 0.091402 0.139187 0.143878 0.161537 0.165959 0.121985 0.102905 0.115461
qa: -0.2881 -0.4034 -0.3968 -0.4162 -0.1377 -0.0697 -0.1813 -0.1535 -0.0719 -0.0179 -0.1813 -0.1502 -0.1175 -0.1399 -0.0717 -0.0947 0.2381 0.3749 -0.1049 0.0012 -0.2818 0.3386 -0.0910 -0.1376 -0.1296 -0.1241 0.4262 -0.2388 0.0728 0.0687 0.0798 -0.0096 0.0751 0.0729 0.0675 0.0711 0.0872 0.0276 0.0883 -0.0553 0.0865 0.0838 0.0649 0.0787 0.0931 0.1072 0.0590 0.0781 0.0568 0.0694 0.0703 0.0844 0.0914 0.1392 0.1439 0.1615 0.1660 0.1220 0.1029 0.1155
va: 2.1278 2.0865 2.0929 2.0726 3.8861 3.8427 3.9519 3.9351 3.8016 3.8545 3.9002 3.9122 3.8467 3.8789 3.7116 3.8547 3.6947 3.9324 3.6590 3.5679 3.9434 4.1009 3.8933 3.8638 3.9221 3.8641 4.0304 3.9249 1.0119 1.0038 1.0107 1.0214 1.0061 1.0083 1.0113 1.0090 1.0093 1.0295 1.0050 1.0500 1.0128 1.0127 1.0101 1.0106 1.0212 1.0164 1.0113 1.0118 1.0037 1.0083 1.0014 1.0032 1.0032 1.0205 1.0213 0.9907 0.9861 1.0005 1.0132 1.0040
dispcorr: -0.036937875 hartree
energy: -1234.932056708128
dipole: -16.01074 16.18620 0.17546 -4.48678 4.69313 0.20635 29.22418 -29.47454 -0.25037
magnitude: 0.36885 au
magnitude: 0.93755 debye
