program: Orca
programVersion: 5.0.2
elementType: O O O O C C C C C C C C C C C C C C C C C C C C C C C C H H H H H H H H H H H H H H H H H H H H H H H H H H H H H H H H
charge: 0
multiplicity: 1
keywords: wb97x-d3
keywords: def2-TZVPP
keywords: def2/J RIJCOSX
keywords: DEFGRID2
keywords: scfconv7
keywords: smallprint printgap noloewdin
keywords: NOSOSCF
formula: C24H32O4
InChI: InChI=1/C24H32O4/c1-3-4-5-6-7-8-9-10-11-12-17-21-22(26)19-15-13-14-16-20(19)23(27)24(21)28-18(2)25/h13-16H,3-12,17H2,1-2H3
60 atoms
O  1.4838 -1.829461 -1.827852
O  2.793137 2.442498 -0.484071
O  -0.785607 -0.705484 -2.670458
O  -0.121794 -2.60189 -0.470107
C  1.366292 0.371114 2.794868
C  -0.107409 0.421198 3.193257
C  1.79439 -0.970954 2.210853
C  -1.078844 0.365686 2.01927
C  3.292695 -1.104415 1.953731
C  -2.537454 0.362576 2.460919
C  3.915585 -0.10816 0.980699
C  -3.541143 0.40194 1.311054
C  3.518557 -0.272105 -0.49497
C  -3.452845 -0.766452 0.330908
C  2.161909 0.221587 -0.894719
C  -3.622437 -2.14943 0.954314
C  1.229478 -0.532737 -1.494457
C  1.891396 1.678547 -0.756728
C  0.512095 2.175547 -0.969483
C  -0.441231 1.356606 -1.573739
C  -4.959429 -2.346396 1.654721
C  -0.073087 -0.010985 -1.978877
C  0.170463 3.464471 -0.582446
C  -1.728841 1.827655 -1.793914
C  -1.123362 3.922998 -0.780203
C  -2.070358 3.107933 -1.386054
C  0.680605 -2.806547 -1.336689
C  0.945369 -4.104918 -2.015659
H  1.979955 0.583692 3.677064
H  1.572911 1.181063 2.087742
H  -0.293298 1.339177 3.760152
H  -0.320695 -0.404788 3.881662
H  1.241903 -1.175008 1.293593
H  1.501403 -1.762228 2.909313
H  -0.899767 1.226458 1.364978
H  -0.877486 -0.521592 1.413399
H  3.819191 -1.007532 2.909033
H  3.502001 -2.119618 1.600691
H  -2.722984 -0.516342 3.087689
H  -2.716923 1.22823 3.107137
H  4.999177 -0.244432 1.017288
H  3.74192 0.914023 1.318468
H  -3.4043 1.334136 0.753084
H  -4.552242 0.455686 1.725903
H  3.6268 -1.320893 -0.772081
H  4.245317 0.275325 -1.102413
H  -4.218477 -0.629913 -0.440398
H  -2.496305 -0.73497 -0.197487
H  -2.808073 -2.345768 1.658247
H  -3.516862 -2.899836 0.165777
H  -5.071271 -1.690223 2.519579
H  -5.794349 -2.142111 0.980215
H  -5.072926 -3.371126 2.012708
H  0.904788 4.107209 -0.115525
H  -2.467584 1.196385 -2.269485
H  -1.393049 4.921401 -0.462294
H  -3.077676 3.470719 -1.541662
H  0.470189 -4.092343 -2.999265
H  0.525198 -4.924922 -1.439816
H  2.010891 -4.269924 -2.168263
elementType: O C H
totalener: -1234.89216323 hartree
nucrepener: 2863.12439740 hartree
electener: -4098.01656063 hartree
oneelecener: -7372.85281345 hartree
twoeener: 3274.83625281 hartree
cpcmener: -0.02639843 hartree
kineticenergy: 1229.28905154 hartree
xcener: -121.326412850009 hartree
chargesum: -0.0000000
charge: -0.291211 -0.400873 -0.393003 -0.424262 -0.144270 -0.149924 -0.042192 -0.055743 -0.163367 -0.141019 -0.153868 -0.173116 -0.113841 -0.088590 -0.066427 -0.114331 0.261378 0.283579 -0.061290 0.001070 -0.281712 0.298892 -0.091186 -0.138749 -0.114675 -0.130434 0.446663 -0.238963 0.083526 0.059234 0.072243 0.062138 -0.007212 0.080695 0.025061 0.038411 0.076959 0.069881 0.069451 0.073221 0.089186 0.085803 0.073379 0.091681 0.093297 0.112710 0.083138 0.012400 0.058889 0.070771 0.077902 0.081629 0.092426 0.141039 0.144830 0.162591 0.164916 0.122313 0.104343 0.114612
qa: -0.2912 -0.4009 -0.3930 -0.4243 -0.1443 -0.1499 -0.0422 -0.0557 -0.1634 -0.1410 -0.1539 -0.1731 -0.1138 -0.0886 -0.0664 -0.1143 0.2614 0.2836 -0.0613 0.0011 -0.2817 0.2989 -0.0912 -0.1387 -0.1147 -0.1304 0.4467 -0.2390 0.0835 0.0592 0.0722 0.0621 -0.0072 0.0807 0.0251 0.0384 0.0770 0.0699 0.0695 0.0732 0.0892 0.0858 0.0734 0.0917 0.0933 0.1127 0.0831 0.0124 0.0589 0.0708 0.0779 0.0816 0.0924 0.1410 0.1448 0.1626 0.1649 0.1223 0.1043 0.1146
va: 2.1306 2.0844 2.0920 2.0730 3.8908 3.9406 3.8367 3.8463 3.9364 3.9064 3.8832 3.8864 3.8271 3.8613 3.6589 3.8939 3.6758 3.9933 3.6308 3.5300 3.9434 4.0793 3.9191 3.8890 3.9272 3.8989 3.9973 3.9222 1.0109 1.0126 1.0093 1.0097 1.0354 1.0128 1.0302 1.0080 1.0061 1.0103 1.0021 1.0112 1.0063 1.0148 1.0148 1.0017 1.0233 1.0101 1.0089 1.0219 1.0035 1.0089 0.9985 1.0007 1.0051 1.0191 1.0164 0.9892 0.9897 1.0004 1.0124 1.0044
dispcorr: -0.038596696 hartree
energy: -1234.930759926875
dipole: -16.19849 16.47651 0.27802 -12.87936 13.01109 0.13173 28.71882 -28.89236 -0.17354
magnitude: 0.35322 au
magnitude: 0.89781 debye
