program: Orca
programVersion: 5.0.2
elementType: O O O O C C C C C C C C C C C C C C C C C C C C C C C C H H H H H H H H H H H H H H H H H H H H H H H H H H H H H H H H
charge: 0
multiplicity: 1
keywords: wb97x-d3
keywords: def2-TZVPP
keywords: def2/J RIJCOSX
keywords: DEFGRID2
keywords: scfconv7
keywords: smallprint printgap noloewdin
keywords: NOSOSCF
formula: C24H32O4
InChI: InChI=1/C24H32O4/c1-3-4-5-6-7-8-9-10-11-12-17-21-22(26)19-15-13-14-16-20(19)23(27)24(21)28-18(2)25/h13-16H,3-12,17H2,1-2H3
60 atoms
O  2.185987 -1.850771 -1.831685
O  2.231339 2.620629 -0.463531
O  -0.352506 -1.483268 -2.595146
O  0.92651 -2.96811 -0.358106
C  1.513978 -0.980232 2.792612
C  0.053953 -0.911163 3.233123
C  2.091808 0.365738 2.372641
C  -0.902718 -0.438885 2.143476
C  3.572228 0.32491 1.999135
C  -2.36907 -0.518521 2.54887
C  3.952411 -0.489435 0.762387
C  -3.302476 0.055276 1.490407
C  3.702353 0.190151 -0.593446
C  -4.777746 -0.047926 1.857293
C  2.265044 0.333209 -0.990455
C  -5.718014 0.556058 0.816761
C  1.569185 -0.67058 -1.541382
C  1.597128 1.654341 -0.83193
C  0.14704 1.762854 -1.124862
C  -0.542989 0.694366 -1.700637
C  -5.643601 2.074069 0.725175
C  0.165241 -0.562953 -2.000692
C  -0.527863 2.943065 -0.839042
C  -1.894213 0.814892 -1.999047
C  -1.880221 3.053972 -1.125109
C  -2.561227 1.994432 -1.709464
C  1.744734 -2.98473 -1.233479
C  2.40523 -4.185623 -1.816745
H  1.598908 -1.698688 1.972785
H  2.11702 -1.385454 3.612093
H  -0.034872 -0.251049 4.103337
H  -0.257222 -1.903557 3.575267
H  1.967703 1.074294 3.198639
H  1.500599 0.775536 1.552342
H  -0.671797 0.59496 1.867844
H  -0.743488 -1.036116 1.238089
H  3.940431 1.347802 1.871884
H  4.123491 -0.081359 2.853298
H  -2.636997 -1.56138 2.751699
H  -2.516682 0.020967 3.491307
H  3.475091 -1.472086 0.782441
H  5.026641 -0.685245 0.804942
H  -3.134498 -0.464888 0.540588
H  -3.030579 1.100807 1.312899
H  4.21704 -0.389068 -1.362297
H  4.174134 1.17296 -0.586911
H  -5.032078 -1.103121 1.999965
H  -4.951793 0.436896 2.824728
H  -6.7460 0.267869 1.053442
H  -5.501732 0.117936 -0.163373
H  -6.344782 2.460665 -0.01652
H  -5.891748 2.539129 1.681793
H  -4.649663 2.42387 0.442158
H  -0.000954 3.774761 -0.390943
H  -2.427266 -0.011486 -2.449818
H  -2.403178 3.97273 -0.894704
H  -3.615062 2.085493 -1.937076
H  2.232109 -5.055062 -1.188624
H  3.476456 -4.030372 -1.942093
H  1.984488 -4.380136 -2.805944
elementType: O C H
totalener: -1234.89469307 hartree
nucrepener: 2800.46172958 hartree
electener: -4035.35642265 hartree
oneelecener: -7247.35586124 hartree
twoeener: 3211.99943860 hartree
cpcmener: -0.02652851 hartree
kineticenergy: 1229.28968973 hartree
xcener: -121.322129864329 hartree
chargesum: 0.0000000
charge: -0.288545 -0.398928 -0.396866 -0.418035 -0.148121 -0.148568 -0.065231 -0.059753 -0.178913 -0.162670 -0.146056 -0.091592 -0.128152 -0.126464 -0.058515 -0.102840 0.188599 0.409367 -0.103199 -0.052915 -0.275139 0.341428 -0.091016 -0.095650 -0.114530 -0.158423 0.421500 -0.231926 0.058197 0.077358 0.063330 0.069068 0.083262 0.023828 0.053948 0.044701 0.077615 0.081304 0.060378 0.059121 0.078182 0.091146 0.060308 0.052633 0.104150 0.097870 0.069122 0.059549 0.073814 0.053989 0.093160 0.085532 0.060366 0.138935 0.138844 0.162458 0.169007 0.102713 0.115427 0.121837
qa: -0.2885 -0.3989 -0.3969 -0.4180 -0.1481 -0.1486 -0.0652 -0.0598 -0.1789 -0.1627 -0.1461 -0.0916 -0.1282 -0.1265 -0.0585 -0.1028 0.1886 0.4094 -0.1032 -0.0529 -0.2751 0.3414 -0.0910 -0.0956 -0.1145 -0.1584 0.4215 -0.2319 0.0582 0.0774 0.0633 0.0691 0.0833 0.0238 0.0539 0.0447 0.0776 0.0813 0.0604 0.0591 0.0782 0.0911 0.0603 0.0526 0.1041 0.0979 0.0691 0.0595 0.0738 0.0540 0.0932 0.0855 0.0604 0.1389 0.1388 0.1625 0.1690 0.1027 0.1154 0.1218
va: 2.1242 2.0878 2.0948 2.0791 3.8789 3.9293 3.8547 3.8492 3.9373 3.9733 3.8802 3.8672 3.8349 3.9104 3.7055 3.8766 3.7926 3.8975 3.6669 3.6008 3.9293 4.0515 3.9305 3.8483 3.8875 3.8862 4.0353 3.9156 1.0260 1.0157 1.0099 1.0102 1.0115 1.0231 1.0080 1.0241 1.0108 1.0062 1.0112 1.0088 1.0123 1.0071 1.0068 1.0056 1.0129 1.0274 1.0111 1.0082 1.0068 1.0104 1.0035 1.0054 0.9996 1.0225 1.0234 0.9911 0.9831 1.0136 1.0032 1.0009
dispcorr: -0.036359313 hartree
energy: -1234.931052380526
dipole: -18.99225 19.22486 0.23261 -1.32394 1.50844 0.18450 29.05309 -29.40435 -0.35126
magnitude: 0.45992 au
magnitude: 1.16903 debye
