program: Orca
programVersion: 5.0.2
elementType: O O O O C C C C C C C C C C C C C C C C C C C C C C C C H H H H H H H H H H H H H H H H H H H H H H H H H H H H H H H H
charge: 0
multiplicity: 1
keywords: wb97x-d3
keywords: def2-TZVPP
keywords: def2/J RIJCOSX
keywords: DEFGRID2
keywords: scfconv7
keywords: smallprint printgap noloewdin
keywords: NOSOSCF
formula: C24H32O4
InChI: InChI=1/C24H32O4/c1-3-4-5-6-7-8-9-10-11-12-17-21-22(26)19-15-13-14-16-20(19)23(27)24(21)28-18(2)25/h13-16H,3-12,17H2,1-2H3
60 atoms
O  1.527755 1.210546 2.166127
O  2.551484 1.46519 -2.403241
O  -0.818133 2.309675 1.600836
O  0.14507 -0.542204 2.177199
C  1.511648 -3.582266 0.195597
C  0.118249 -3.322216 -0.368521
C  2.646986 -3.171115 -0.741717
C  -0.993415 -3.844101 0.535921
C  2.794558 -1.66525 -0.952473
C  -2.369185 -3.878577 -0.125721
C  3.359471 -0.950542 0.268812
C  -2.934509 -2.529299 -0.561334
C  3.440233 0.57674 0.137619
C  -3.219095 -1.568454 0.587258
C  2.105033 1.205604 -0.115363
C  -3.961658 -0.314648 0.142154
C  1.219145 1.445783 0.857654
C  1.737042 1.569672 -1.510814
C  0.357168 2.037986 -1.789934
C  -0.539463 2.272466 -0.745749
C  -4.255076 0.641659 1.288249
C  -0.11954 2.043563 0.646651
C  -0.046878 2.248127 -3.102432
C  -1.826493 2.72013 -1.015586
C  -1.337543 2.679412 -3.368483
C  -2.22562 2.916487 -2.327973
C  0.837737 0.222249 2.788728
C  1.05792 0.245855 4.260351
H  1.606958 -4.652801 0.403987
H  1.614745 -3.083668 1.164869
H  0.039901 -3.806286 -1.349549
H  -0.021963 -2.252305 -0.547993
H  2.487631 -3.654416 -1.710888
H  3.593058 -3.570576 -0.361748
H  -0.743656 -4.863831 0.847613
H  -1.024635 -3.253787 1.45721
H  3.45183 -1.482763 -1.807732
H  1.822499 -1.244087 -1.225855
H  -2.315253 -4.536826 -0.999304
H  -3.081128 -4.350482 0.559748
H  4.370949 -1.319174 0.461579
H  2.775508 -1.204109 1.155797
H  -3.867548 -2.70998 -1.105393
H  -2.261586 -2.051033 -1.280666
H  4.122419 0.839152 -0.67099
H  3.86945 0.987321 1.052829
H  -3.811937 -2.084806 1.351427
H  -2.285661 -1.27538 1.076851
H  -4.900851 -0.603616 -0.340533
H  -3.375453 0.201321 -0.625085
H  -4.884963 0.170725 2.046012
H  -3.33754 0.965135 1.783164
H  -4.776435 1.536467 0.943648
H  0.64104 2.069362 -3.917738
H  -2.516216 2.908468 -0.203647
H  -1.650777 2.832304 -4.392683
H  -3.231458 3.254312 -2.538994
H  0.455444 1.048422 4.691999
H  2.098905 0.445611 4.509952
H  0.746735 -0.696083 4.703539
elementType: O C H
totalener: -1234.89707138 hartree
nucrepener: 2806.90657159 hartree
electener: -4041.80364297 hartree
oneelecener: -7260.66148933 hartree
twoeener: 3218.85784636 hartree
cpcmener: -0.02561182 hartree
kineticenergy: 1229.29808142 hartree
xcener: -121.321298110404 hartree
chargesum: 0.0000000
charge: -0.292856 -0.398473 -0.400431 -0.419802 -0.137596 -0.131752 -0.147576 -0.136135 -0.134356 -0.156040 -0.143881 -0.135126 -0.132579 -0.093978 -0.039774 -0.090987 0.197651 0.366099 -0.075360 -0.008978 -0.295118 0.318236 -0.095560 -0.155287 -0.129011 -0.108947 0.432565 -0.235610 0.077043 0.062906 0.068431 0.052973 0.075929 0.074290 0.072734 0.066290 0.085309 0.064708 0.072882 0.073507 0.085875 0.071755 0.073386 0.069011 0.099533 0.104343 0.060842 0.038067 0.066213 0.047801 0.089802 0.072618 0.093215 0.140449 0.151951 0.163146 0.163228 0.123058 0.114705 0.104665
qa: -0.2929 -0.3985 -0.4004 -0.4198 -0.1376 -0.1318 -0.1476 -0.1361 -0.1344 -0.1560 -0.1439 -0.1351 -0.1326 -0.0940 -0.0398 -0.0910 0.1977 0.3661 -0.0754 -0.0090 -0.2951 0.3182 -0.0956 -0.1553 -0.1290 -0.1089 0.4326 -0.2356 0.0770 0.0629 0.0684 0.0530 0.0759 0.0743 0.0727 0.0663 0.0853 0.0647 0.0729 0.0735 0.0859 0.0718 0.0734 0.0690 0.0995 0.1043 0.0608 0.0381 0.0662 0.0478 0.0898 0.0726 0.0932 0.1404 0.1520 0.1631 0.1632 0.1231 0.1147 0.1047
va: 2.1278 2.0856 2.0786 2.0509 3.8707 3.8440 3.9220 3.8480 3.8643 3.9202 3.8842 3.8664 3.8485 3.8494 3.7142 3.8686 3.7824 3.9417 3.7341 3.5994 3.9357 4.0712 3.9418 3.8998 3.9417 3.9155 3.9851 3.9248 1.0134 1.0122 1.0129 1.0074 1.0075 1.0088 1.0131 1.0129 1.0127 1.0050 1.0081 1.0090 1.0155 1.0149 1.0107 1.0024 1.0262 1.0127 1.0131 1.0180 1.0102 1.0045 1.0054 1.0078 1.0023 1.0219 1.0105 0.9898 0.9897 1.0008 1.0050 1.0121
dispcorr: -0.034657071 hartree
energy: -1234.931728449374
dipole: -14.09473 14.23523 0.14050 -34.06758 34.48748 0.41990 4.74426 -4.71021 0.03405
magnitude: 0.44409 au
magnitude: 1.12879 debye
