program: Orca
programVersion: 5.0.2
elementType: O O O O C C C C C C C C C C C C C C C C C C C C C C C C H H H H H H H H H H H H H H H H H H H H H H H H H H H H H H H H
charge: 0
multiplicity: 1
keywords: wb97x-d3
keywords: def2-TZVPP
keywords: def2/J RIJCOSX
keywords: DEFGRID2
keywords: scfconv7
keywords: smallprint printgap noloewdin
keywords: NOSOSCF
formula: C24H32O4
InChI: InChI=1/C24H32O4/c1-3-4-5-6-7-8-9-10-11-12-17-21-22(26)19-15-13-14-16-20(19)23(27)24(21)28-18(2)25/h13-16H,3-12,17H2,1-2H3
60 atoms
O  1.346901 -2.041687 -0.961743
O  2.735281 2.420029 -0.578975
O  -1.068536 -1.144019 -1.614352
O  1.386173 -2.218311 -3.189771
C  1.244361 -0.828017 2.842796
C  -0.14973 -0.492094 3.366235
C  2.067448 0.400824 2.471598
C  -1.111964 0.026486 2.30296
C  3.518414 0.098379 2.098064
C  -2.451581 0.456407 2.889505
C  3.751625 -0.866922 0.937191
C  -3.459884 0.957738 1.858513
C  3.537219 -0.29582 -0.471504
C  -3.919913 -0.080003 0.837161
C  2.145022 0.15882 -0.781723
C  -4.617313 -1.292988 1.440782
C  1.149331 -0.695267 -1.045768
C  1.851259 1.618051 -0.794724
C  0.467622 2.070671 -1.079797
C  -0.535855 1.148376 -1.384398
C  -5.129676 -2.257854 0.381595
C  -0.235912 -0.294851 -1.37577
C  0.170723 3.42766 -1.055601
C  -1.820817 1.587245 -1.677852
C  -1.116636 3.859988 -1.335138
C  -2.109439 2.942566 -1.650966
C  1.36579 -2.753234 -2.118281
C  1.367224 -4.216225 -1.84108
H  1.148877 -1.4986 1.982826
H  1.786713 -1.394814 3.607267
H  -0.063069 0.244195 4.173629
H  -0.585832 -1.386304 3.822807
H  2.080538 1.082588 3.328573
H  1.565586 0.955927 1.676747
H  -0.670528 0.876628 1.771821
H  -1.259204 -0.756596 1.551552
H  4.040767 1.038427 1.893991
H  4.007941 -0.323897 2.981314
H  -2.882842 -0.370858 3.46267
H  -2.2735 1.254856 3.617215
H  3.156079 -1.772349 1.068108
H  4.793472 -1.194787 0.972327
H  -3.028341 1.812188 1.325883
H  -4.338026 1.346266 2.384853
H  3.822572 -1.06038 -1.19798
H  4.224079 0.536972 -0.62129
H  -4.604401 0.406364 0.133996
H  -3.072147 -0.420314 0.235252
H  -5.450859 -0.958846 2.067468
H  -3.932865 -1.826129 2.106777
H  -5.629249 -3.118845 0.82883
H  -5.846687 -1.77394 -0.284969
H  -4.313491 -2.637627 -0.236878
H  0.941185 4.148605 -0.8178
H  -2.595908 0.874997 -1.92584
H  -1.344486 4.917324 -1.310636
H  -3.111286 3.28319 -1.876186
H  1.549751 -4.775625 -2.754156
H  0.397336 -4.509524 -1.434724
H  2.122223 -4.473832 -1.098436
elementType: O C H
totalener: -1234.89390587 hartree
nucrepener: 2816.73377227 hartree
electener: -4051.62767814 hartree
oneelecener: -7279.46187448 hartree
twoeener: 3227.83419634 hartree
cpcmener: -0.02679184 hartree
kineticenergy: 1229.29666185 hartree
xcener: -121.324435884249 hartree
chargesum: 0.0000000
charge: -0.294272 -0.398806 -0.406594 -0.412088 -0.127081 -0.158856 -0.087302 -0.093448 -0.183319 -0.165308 -0.142297 -0.131520 -0.152621 -0.127198 -0.019344 -0.082881 0.176187 0.397809 -0.104979 -0.038141 -0.280533 0.351325 -0.090318 -0.124724 -0.115730 -0.130323 0.399048 -0.233423 0.056744 0.085067 0.061187 0.075995 0.083452 0.041907 0.048441 0.062684 0.077967 0.084596 0.071055 0.077817 0.083245 0.089008 0.065361 0.083602 0.107772 0.099259 0.080521 0.028602 0.060287 0.057532 0.089125 0.077730 0.079094 0.138930 0.144143 0.163264 0.162350 0.101602 0.121492 0.116907
qa: -0.2943 -0.3988 -0.4066 -0.4121 -0.1271 -0.1589 -0.0873 -0.0934 -0.1833 -0.1653 -0.1423 -0.1315 -0.1526 -0.1272 -0.0193 -0.0829 0.1762 0.3978 -0.1050 -0.0381 -0.2805 0.3513 -0.0903 -0.1247 -0.1157 -0.1303 0.3990 -0.2334 0.0567 0.0851 0.0612 0.0760 0.0835 0.0419 0.0484 0.0627 0.0780 0.0846 0.0711 0.0778 0.0832 0.0890 0.0654 0.0836 0.1078 0.0993 0.0805 0.0286 0.0603 0.0575 0.0891 0.0777 0.0791 0.1389 0.1441 0.1633 0.1624 0.1016 0.1215 0.1169
va: 2.0856 2.0855 2.0699 2.0888 3.8852 3.9440 3.8541 3.8437 3.9223 3.9129 3.8721 3.8794 3.8602 3.8713 3.7338 3.8714 3.7342 3.8761 3.7158 3.5668 3.9478 3.9378 3.9453 3.8797 3.9303 3.9153 4.0913 3.9091 1.0126 1.0091 1.0105 1.0085 1.0117 1.0190 1.0123 1.0064 1.0123 1.0054 1.0021 1.0100 1.0083 1.0077 1.0137 1.0069 1.0119 1.0256 1.0083 1.0048 1.0082 1.0045 1.0043 1.0017 1.0014 1.0232 1.0153 0.9894 0.9913 1.0145 1.0012 1.0016
dispcorr: -0.036281697 hartree
energy: -1234.930187565627
dipole: -18.30322 18.04799 -0.25522 -10.56721 10.59977 0.03256 30.33699 -29.31540 1.02159
magnitude: 1.05349 au
magnitude: 2.67776 debye
