program: Orca
programVersion: 5.0.2
elementType: O O O O C C C C C C C C C C C C C C C C C C C C C C C C H H H H H H H H H H H H H H H H H H H H H H H H H H H H H H H H
charge: 0
multiplicity: 1
keywords: wb97x-d3
keywords: def2-TZVPP
keywords: def2/J RIJCOSX
keywords: DEFGRID2
keywords: scfconv7
keywords: smallprint printgap noloewdin
keywords: NOSOSCF
formula: C24H32O4
InChI: InChI=1/C24H32O4/c1-3-4-5-6-7-8-9-10-11-12-17-21-22(26)19-15-13-14-16-20(19)23(27)24(21)28-18(2)25/h13-16H,3-12,17H2,1-2H3
60 atoms
O  1.416309 -2.057847 -1.756615
O  2.405715 0.192695 2.235613
O  -1.055297 -2.420261 -0.8357
O  1.498829 -4.157034 -0.993695
C  1.38125 3.57466 -0.244162
C  -0.111782 3.89698 -0.224228
C  1.698765 2.190497 -0.79747
C  -0.893603 3.111265 0.825241
C  3.186445 1.855134 -0.750223
C  -2.385949 3.434889 0.860031
C  3.552744 0.465271 -1.27056
C  -3.176474 2.993142 -0.370995
C  3.405736 -0.68939 -0.265896
C  -3.247133 1.480857 -0.54788
C  2.007233 -0.924109 0.211902
C  -4.069163 1.048343 -1.755064
C  1.103174 -1.594214 -0.512323
C  1.594442 -0.367884 1.529224
C  0.181074 -0.506637 1.955638
C  -0.734766 -1.207862 1.168187
C  -4.192374 -0.463243 -1.873688
C  -0.30453 -1.803885 -0.109797
C  -0.23841 0.077251 3.144314
C  -2.058196 -1.324033 1.574282
C  -1.56186 -0.035077 3.542134
C  -2.469568 -0.736735 2.760355
C  1.518857 -3.401861 -1.922105
C  1.660467 -3.750371 -3.363404
H  1.783747 3.663179 0.771409
H  1.907092 4.325198 -0.842927
H  -0.526622 3.718518 -1.221588
H  -0.247119 4.965757 -0.029874
H  1.351955 2.12782 -1.834909
H  1.115836 1.444968 -0.253575
H  -0.755996 2.036542 0.676959
H  -0.465269 3.32894 1.809395
H  3.719106 2.59817 -1.351723
H  3.564419 1.978091 0.269975
H  -2.82895 2.965369 1.744734
H  -2.510856 4.513833 0.99912
H  4.60066 0.466152 -1.578026
H  2.975932 0.24557 -2.172892
H  -2.757065 3.44854 -1.274074
H  -4.195578 3.384913 -0.28933
H  4.051009 -0.497557 0.591327
H  3.77968 -1.602572 -0.732546
H  -2.239229 1.0634 -0.641878
H  -3.673989 1.035661 0.358252
H  -3.614833 1.451134 -2.665789
H  -5.068658 1.49028 -1.693633
H  -3.212939 -0.939605 -1.939488
H  -4.707347 -0.888596 -1.009735
H  -4.755054 -0.752262 -2.762513
H  0.464215 0.625658 3.757271
H  -2.767481 -1.866926 0.963823
H  -1.884935 0.426736 4.465733
H  -3.501441 -0.823837 3.073621
H  2.430692 -3.143632 -3.839511
H  0.720186 -3.549508 -3.880214
H  1.905633 -4.802612 -3.475904
elementType: O C H
totalener: -1234.89435489 hartree
nucrepener: 2810.41864544 hartree
electener: -4045.31300034 hartree
oneelecener: -7266.81749265 hartree
twoeener: 3221.50449232 hartree
cpcmener: -0.02734076 hartree
kineticenergy: 1229.30156407 hartree
xcener: -121.323867839793 hartree
chargesum: 0.0000000
charge: -0.293958 -0.397918 -0.408348 -0.411490 -0.134534 -0.138975 -0.070580 -0.063859 -0.153550 -0.143308 -0.134419 -0.146228 -0.152339 -0.090028 -0.066614 -0.086504 0.227648 0.395108 -0.095052 -0.023631 -0.283891 0.362462 -0.113314 -0.132443 -0.119593 -0.120523 0.406086 -0.232011 0.060075 0.076750 0.064327 0.075266 0.073904 -0.000989 -0.024229 0.083489 0.083430 0.068949 0.070459 0.077737 0.090108 0.074735 0.065970 0.073809 0.098950 0.104794 0.048902 0.051443 0.057046 0.054494 0.073538 0.078503 0.095748 0.136389 0.143339 0.162355 0.163183 0.117113 0.120656 0.101562
qa: -0.2940 -0.3979 -0.4083 -0.4115 -0.1345 -0.1390 -0.0706 -0.0639 -0.1535 -0.1433 -0.1344 -0.1462 -0.1523 -0.0900 -0.0666 -0.0865 0.2276 0.3951 -0.0951 -0.0236 -0.2839 0.3625 -0.1133 -0.1324 -0.1196 -0.1205 0.4061 -0.2320 0.0601 0.0768 0.0643 0.0753 0.0739 -0.0010 -0.0242 0.0835 0.0834 0.0689 0.0705 0.0777 0.0901 0.0747 0.0660 0.0738 0.0990 0.1048 0.0489 0.0514 0.0570 0.0545 0.0735 0.0785 0.0957 0.1364 0.1433 0.1624 0.1632 0.1171 0.1207 0.1016
va: 2.1117 2.0845 2.0714 2.0890 3.9182 3.9294 3.8252 3.8511 3.8803 3.9109 3.8971 3.9086 3.8629 3.8615 3.7692 3.8849 3.7006 3.8783 3.6646 3.5712 3.9420 4.0255 3.9020 3.8762 3.9061 3.8962 4.0789 3.9064 1.0117 1.0099 1.0069 1.0100 1.0154 1.0398 1.0275 1.0094 1.0075 1.0145 1.0107 1.0085 1.0058 1.0154 1.0041 1.0112 1.0249 1.0129 1.0014 1.0073 1.0059 1.0078 1.0057 0.9992 1.0081 1.0248 1.0186 0.9894 0.9898 1.0019 1.0017 1.0143
dispcorr: -0.036241063 hartree
energy: -1234.930595957229
dipole: -14.55760 14.26589 -0.29170 31.43496 -30.40550 1.02946 -13.71597 13.28023 -0.43574
magnitude: 1.15531 au
magnitude: 2.93656 debye
