program: Orca
programVersion: 5.0.2
elementType: O O O O C C C C C C C C C C C C C C C C C C C C C C C C H H H H H H H H H H H H H H H H H H H H H H H H H H H H H H H H
charge: 0
multiplicity: 1
keywords: wb97x-d3
keywords: def2-TZVPP
keywords: def2/J RIJCOSX
keywords: DEFGRID2
keywords: scfconv7
keywords: smallprint printgap noloewdin
keywords: NOSOSCF
formula: C24H32O4
InChI: InChI=1/C24H32O4/c1-3-4-5-6-7-8-9-10-11-12-17-21-22(26)19-15-13-14-16-20(19)23(27)24(21)28-18(2)25/h13-16H,3-12,17H2,1-2H3
60 atoms
O  1.469194 -1.906824 -1.842162
O  2.588352 2.454584 -0.56482
O  -0.955767 -0.984295 -2.452006
O  0.189286 -2.682747 -0.174987
C  1.390154 -0.424562 3.185367
C  0.6670 0.890616 2.910941
C  2.914178 -0.294749 3.222474
C  -0.855405 0.792697 2.930573
C  3.535854 0.176011 1.908335
C  -1.41493 -0.205975 1.922652
C  3.470401 -0.866745 0.789103
C  -2.900443 -0.019898 1.648936
C  3.456514 -0.271797 -0.631104
C  -3.458469 -1.047661 0.673363
C  2.088647 0.205182 -1.019065
C  -4.910447 -0.792875 0.291095
C  1.163882 -0.61899 -1.530526
C  1.738454 1.640145 -0.843795
C  0.317091 2.046408 -0.999457
C  -0.626136 1.156522 -1.509695
C  -5.456117 -1.823536 -0.686684
C  -0.217974 -0.210327 -1.889515
C  -0.073051 3.327642 -0.631142
C  -1.950202 1.548547 -1.658288
C  -1.398065 3.709439 -0.762691
C  -2.335346 2.822384 -1.276784
C  0.800284 -2.890618 -1.176976
C  0.965641 -4.20241 -1.87392
H  1.098419 -1.1668 2.43689
H  1.048356 -0.824906 4.145236
H  0.963386 1.279949 1.932298
H  0.993553 1.640312 3.639329
H  3.351286 -1.25674 3.508816
H  3.190502 0.407721 4.014642
H  -1.202753 0.535432 3.93688
H  -1.264709 1.785151 2.715119
H  3.05647 1.105268 1.600327
H  4.581996 0.444625 2.076183
H  -0.867367 -0.111134 0.979876
H  -1.230847 -1.22922 2.260787
H  2.590622 -1.502001 0.912608
H  4.330879 -1.53497 0.875248
H  -3.065583 0.987841 1.250635
H  -3.460443 -0.065444 2.589852
H  3.78536 -1.028194 -1.344499
H  4.165425 0.55416 -0.696333
H  -2.842637 -1.064545 -0.231901
H  -3.364932 -2.048967 1.106621
H  -4.997543 0.207761 -0.145494
H  -5.529315 -0.778371 1.193616
H  -6.493283 -1.617667 -0.9532
H  -4.873707 -1.839132 -1.609557
H  -5.418869 -2.828295 -0.26283
H  0.662122 4.016438 -0.238287
H  -2.671926 0.850211 -2.059648
H  -1.702089 4.70374 -0.464008
H  -3.368399 3.126074 -1.380411
H  0.63529 -5.012075 -1.23042
H  1.998665 -4.368395 -2.175792
H  0.356837 -4.201421 -2.779444
totalener: -1234.86956519 hartree
nucrepener: 2850.99515858 hartree
electener: -4085.86472377 hartree
oneelecener: -7347.93366468 hartree
twoeener: 3262.06894091 hartree
kineticenergy: 1229.34282138 hartree
xcener: -121.323336853155 hartree
chargesum: 0.0000000
charge: -0.287673 -0.321499 -0.324410 -0.327248 -0.110869 -0.092507 -0.160770 -0.172493 -0.164597 -0.003390 -0.146705 -0.144474 -0.124894 -0.101345 -0.021460 -0.083298 0.190018 0.258021 -0.080522 -0.062882 -0.256847 0.305199 -0.082939 -0.111387 -0.084858 -0.114008 0.379478 -0.255303 0.063565 0.072855 0.028898 0.077036 0.072537 0.069637 0.068359 0.064569 0.089076 0.081954 -0.039739 0.079836 0.071234 0.084969 0.042592 0.073247 0.096939 0.104380 0.045495 0.068727 0.040218 0.057778 0.081527 0.076348 0.072600 0.134375 0.134921 0.134305 0.134792 0.104638 0.102136 0.113861
qa: -0.2877 -0.3215 -0.3244 -0.3272 -0.1109 -0.0925 -0.1608 -0.1725 -0.1646 -0.0034 -0.1467 -0.1445 -0.1249 -0.1013 -0.0215 -0.0833 0.1900 0.2580 -0.0805 -0.0629 -0.2568 0.3052 -0.0829 -0.1114 -0.0849 -0.1140 0.3795 -0.2553 0.0636 0.0729 0.0289 0.0770 0.0725 0.0696 0.0684 0.0646 0.0891 0.0820 -0.0397 0.0798 0.0712 0.0850 0.0426 0.0732 0.0969 0.1044 0.0455 0.0687 0.0402 0.0578 0.0815 0.0763 0.0726 0.1344 0.1349 0.1343 0.1348 0.1046 0.1021 0.1139
va: 2.1214 2.1489 2.1507 2.1609 3.8778 3.8733 3.9405 3.9400 3.8692 3.8224 3.8714 3.9138 3.8329 3.8808 3.6548 3.8725 3.7640 3.9995 3.6908 3.6138 3.9542 4.0594 3.9691 3.9343 3.9411 3.9289 4.0830 3.9111 1.0139 1.0125 1.0186 1.0157 1.0073 1.0100 1.0126 1.0089 1.0126 1.0103 1.0630 1.0148 1.0271 1.0066 1.0118 1.0131 1.0155 1.0242 1.0107 1.0158 1.0081 1.0099 1.0053 1.0038 1.0037 1.0255 1.0160 0.9989 1.0009 1.0137 1.0059 1.0041
dispcorr: -0.037954979 hartree
energy: -1234.907520164531
dipole: -14.52677 14.57071 0.04394 -9.81652 9.74729 -0.06923 25.41492 -25.65211 -0.23718
magnitude: 0.25095 au
magnitude: 0.63787 debye
