program: Orca
programVersion: 5.0.2
elementType: O O O O C C C C C C C C C C C C C C C C C C C C C C C C H H H H H H H H H H H H H H H H H H H H H H H H H H H H H H H H
charge: 0
multiplicity: 1
keywords: wb97x-d3
keywords: def2-TZVPP
keywords: def2/J RIJCOSX
keywords: DEFGRID2
keywords: scfconv7
keywords: smallprint printgap noloewdin
keywords: NOSOSCF
formula: C24H32O4
InChI: InChI=1/C24H32O4/c1-3-4-5-6-7-8-9-10-11-12-17-21-22(26)19-15-13-14-16-20(19)23(27)24(21)28-18(2)25/h13-16H,3-12,17H2,1-2H3
60 atoms
O  1.398419 -1.90125 -1.815032
O  2.46703 2.469714 -0.511905
O  -1.046531 -1.029236 -2.403632
O  0.137506 -2.673278 -0.130956
C  1.336859 -0.773479 3.216311
C  0.572663 0.528043 3.445558
C  2.853139 -0.573081 3.175204
C  -0.94463 0.374028 3.490947
C  3.335817 0.093946 1.887577
C  -1.591906 0.048713 2.14877
C  3.421297 -0.884897 0.717722
C  -3.113497 -0.005051 2.244178
C  3.381738 -0.223956 -0.668492
C  -3.825815 -0.269037 0.921094
C  2.001268 0.231253 -1.038323
C  -3.599442 -1.664076 0.349514
C  1.080746 -0.610849 -1.527496
C  1.639006 1.663232 -0.868567
C  0.238749 2.082849 -1.138501
C  -0.694867 1.178186 -1.640378
C  -4.347351 -1.891277 -0.955939
C  -0.30254 -0.220526 -1.901315
C  -0.137634 3.398333 -0.897476
C  -1.993844 1.590499 -1.907684
C  -1.437649 3.802274 -1.151947
C  -2.364772 2.900389 -1.657754
C  0.745683 -2.884169 -1.134517
C  0.932916 -4.203026 -1.812221
H  0.998889 -1.253709 2.292976
H  1.085887 -1.470534 4.021657
H  0.82804 1.259219 2.671199
H  0.914061 0.96545 4.38935
H  3.358014 -1.537148 3.29364
H  3.154312 0.028733 4.037921
H  -1.210855 -0.398642 4.220948
H  -1.379235 1.304165 3.871258
H  2.672433 0.926308 1.646994
H  4.317868 0.548949 2.039228
H  -1.306576 0.814172 1.416649
H  -1.204037 -0.897115 1.762819
H  2.614612 -1.618249 0.785863
H  4.349346 -1.456718 0.801855
H  -3.470906 0.944789 2.655232
H  -3.40512 -0.771797 2.970899
H  3.73266 -0.935586 -1.417359
H  4.064919 0.625251 -0.694168
H  -4.901405 -0.117379 1.060429
H  -3.511239 0.481992 0.188087
H  -3.918766 -2.406455 1.088184
H  -2.53461 -1.841553 0.186481
H  -5.420548 -1.731138 -0.835405
H  -3.995661 -1.213171 -1.735072
H  -4.203547 -2.906205 -1.327028
H  0.590771 4.0982 -0.512011
H  -2.7078 0.880804 -2.30244
H  -1.729685 4.825632 -0.957882
H  -3.378579 3.220119 -1.857874
H  0.357688 -4.212548 -2.739124
H  0.582466 -5.006198 -1.171471
H  1.976716 -4.370171 -2.074686
totalener: -1234.87099103 hartree
nucrepener: 2844.25901368 hartree
electener: -4079.13000472 hartree
oneelecener: -7334.53864238 hartree
twoeener: 3255.40863766 hartree
kineticenergy: 1229.33925205 hartree
xcener: -121.321400010471 hartree
chargesum: 0.0000000
charge: -0.287079 -0.324298 -0.328487 -0.338877 -0.097107 -0.130659 -0.152036 -0.139562 -0.131302 -0.069528 -0.161288 -0.123216 -0.117754 -0.112504 -0.026904 -0.087764 0.188970 0.276111 -0.081597 -0.069425 -0.255193 0.285263 -0.067443 -0.143298 -0.107071 -0.086418 0.387346 -0.254088 0.054508 0.068868 0.057061 0.070813 0.072727 0.068803 0.057137 0.064900 0.069352 0.079807 0.018024 0.067641 0.067689 0.082427 0.062379 0.057875 0.097967 0.100132 0.073284 0.031002 0.056579 0.060872 0.073947 0.065480 0.083023 0.135380 0.163885 0.134625 0.137233 0.114113 0.105129 0.102547
qa: -0.2871 -0.3243 -0.3285 -0.3389 -0.0971 -0.1307 -0.1520 -0.1396 -0.1313 -0.0695 -0.1613 -0.1232 -0.1178 -0.1125 -0.0269 -0.0878 0.1890 0.2761 -0.0816 -0.0694 -0.2552 0.2853 -0.0674 -0.1433 -0.1071 -0.0864 0.3873 -0.2541 0.0545 0.0689 0.0571 0.0708 0.0727 0.0688 0.0571 0.0649 0.0694 0.0798 0.0180 0.0676 0.0677 0.0824 0.0624 0.0579 0.0980 0.1001 0.0733 0.0310 0.0566 0.0609 0.0739 0.0655 0.0830 0.1354 0.1639 0.1346 0.1372 0.1141 0.1051 0.1025
va: 2.1204 2.1462 2.1398 2.1434 3.8717 3.8872 3.9222 3.9451 3.8778 3.8747 3.8836 3.9365 3.8368 3.8973 3.6916 3.8833 3.7897 3.9810 3.7369 3.5982 3.9472 4.0878 3.9649 3.9397 3.9652 3.9516 4.0581 3.9115 1.0184 1.0145 1.0122 1.0145 1.0067 1.0099 1.0104 1.0100 1.0175 1.0118 1.0176 1.0103 1.0280 1.0106 1.0115 1.0111 1.0143 1.0251 1.0121 1.0222 1.0112 1.0091 1.0035 1.0109 1.0079 1.0251 0.9987 0.9999 0.9995 1.0046 1.0139 1.0054
dispcorr: -0.036668971 hartree
energy: -1234.907660003478
dipole: -11.90848 12.04291 0.13444 -10.95006 10.94000 -0.01006 26.78504 -27.24868 -0.46365
magnitude: 0.48285 au
magnitude: 1.22730 debye
