program: Orca
programVersion: 5.0.2
elementType: O O O O C C C C C C C C C C C C C C C C C C C C C C C C H H H H H H H H H H H H H H H H H H H H H H H H H H H H H H H H
charge: 0
multiplicity: 1
keywords: wb97x-d3
keywords: def2-TZVPP
keywords: def2/J RIJCOSX
keywords: DEFGRID2
keywords: scfconv7
keywords: smallprint printgap noloewdin
keywords: NOSOSCF
formula: C24H32O4
InChI: InChI=1/C24H32O4/c1-3-4-5-6-7-8-9-10-11-12-17-21-22(26)19-15-13-14-16-20(19)23(27)24(21)28-18(2)25/h13-16H,3-12,17H2,1-2H3
60 atoms
O  1.651984 -1.860165 -1.854302
O  2.329159 2.483672 -0.23299
O  -0.828604 -1.121041 -2.488256
O  0.337316 -2.829309 -0.31758
C  1.660817 0.282779 3.422877
C  0.386979 0.627302 2.656869
C  2.878406 0.124623 2.511269
C  -0.874637 0.610402 3.511707
C  2.807622 -1.144863 1.662787
C  -2.158646 0.800231 2.705749
C  3.730341 -1.179546 0.450575
C  -2.508812 -0.384134 1.809915
C  3.500976 -0.068094 -0.590092
C  -3.804926 -0.184554 1.035727
C  2.068831 0.249854 -0.916747
C  -4.093507 -1.308009 0.047851
C  1.22699 -0.623819 -1.484648
C  1.578172 1.63129 -0.649366
C  0.147667 1.948086 -0.898702
C  -0.69886 1.012011 -1.487986
C  -5.353756 -1.065935 -0.770175
C  -0.175101 -0.312868 -1.872583
C  -0.34487 3.199763 -0.551011
C  -2.028206 1.329103 -1.73723
C  -1.674137 3.50815 -0.787652
C  -2.514735 2.575219 -1.381406
C  1.024504 -2.930876 -1.28597
C  1.349365 -4.183883 -2.033201
H  1.508185 -0.643878 3.987405
H  1.855928 1.060218 4.167152
H  0.261949 -0.072138 1.826206
H  0.498026 1.617232 2.201216
H  3.792801 0.104726 3.111152
H  2.96106 1.014602 1.882203
H  -0.931794 -0.337875 4.057439
H  -0.802979 1.391881 4.274332
H  3.041531 -2.004632 2.297215
H  1.783443 -1.313791 1.326105
H  -2.990868 0.981066 3.393383
H  -2.072589 1.704009 2.091683
H  3.639916 -2.156618 -0.027886
H  4.773207 -1.105253 0.771592
H  -2.58438 -1.291155 2.419463
H  -1.699474 -0.575172 1.098332
H  4.013482 -0.350066 -1.513684
H  3.978036 0.850276 -0.253375
H  -4.642623 -0.087706 1.7353
H  -3.75653 0.766822 0.495294
H  -4.183522 -2.254306 0.589236
H  -3.237171 -1.432172 -0.622102
H  -5.276858 -0.145935 -1.354135
H  -5.54386 -1.88105 -1.468738
H  -6.232095 -0.968993 -0.129655
H  0.315667 3.925825 -0.097677
H  -2.674652 0.59664 -2.201639
H  -2.057392 4.480904 -0.509857
H  -3.552047 2.820709 -1.565996
H  2.418395 -4.265966 -2.2255
H  0.844258 -4.164718 -2.999849
H  1.009484 -5.050652 -1.474779
totalener: -1234.86996159 hartree
nucrepener: 2860.38748734 hartree
electener: -4095.25744893 hartree
oneelecener: -7366.67806192 hartree
twoeener: 3271.42061299 hartree
kineticenergy: 1229.33680307 hartree
xcener: -121.324488362945 hartree
chargesum: 0.0000000
charge: -0.279669 -0.330008 -0.327869 -0.323197 -0.143215 -0.058162 -0.145143 -0.145702 -0.135199 -0.094143 -0.158967 -0.100434 -0.168951 -0.126818 -0.014755 -0.094799 0.162016 0.288309 -0.079381 -0.078905 -0.253731 0.324299 -0.094267 -0.115796 -0.088910 -0.107724 0.366519 -0.247543 0.059441 0.071175 -0.002796 0.059670 0.078615 0.080197 0.057194 0.070492 0.077875 0.086218 0.074227 0.044694 0.076788 0.083426 0.069432 0.044282 0.099924 0.113349 0.076334 0.036657 0.064350 0.056367 0.057715 0.089252 0.075875 0.136216 0.141890 0.133944 0.138022 0.101636 0.114413 0.105270
qa: -0.2797 -0.3300 -0.3279 -0.3232 -0.1432 -0.0582 -0.1451 -0.1457 -0.1352 -0.0941 -0.1590 -0.1004 -0.1690 -0.1268 -0.0148 -0.0948 0.1620 0.2883 -0.0794 -0.0789 -0.2537 0.3243 -0.0943 -0.1158 -0.0889 -0.1077 0.3665 -0.2475 0.0594 0.0712 -0.0028 0.0597 0.0786 0.0802 0.0572 0.0705 0.0779 0.0862 0.0742 0.0447 0.0768 0.0834 0.0694 0.0443 0.0999 0.1133 0.0763 0.0367 0.0643 0.0564 0.0577 0.0893 0.0759 0.1362 0.1419 0.1339 0.1380 0.1016 0.1144 0.1053
va: 2.1204 2.1377 2.1436 2.1678 3.9748 3.8546 3.8583 3.9599 3.8682 3.8786 3.9066 3.8820 3.8462 3.8617 3.6124 3.8894 3.8373 3.9440 3.7330 3.6433 3.9412 4.0270 3.9672 3.9033 3.9345 3.9094 4.0807 3.9089 1.0079 1.0106 1.0215 1.0100 1.0125 1.0221 1.0110 1.0110 1.0137 0.9971 1.0119 1.0144 1.0089 1.0094 1.0182 1.0103 1.0077 1.0211 1.0126 1.0151 1.0106 1.0109 1.0050 1.0064 1.0036 1.0267 1.0128 0.9993 1.0006 1.0055 1.0042 1.0139
dispcorr: -0.038501887 hartree
energy: -1234.908463472294
dipole: -14.03723 14.13339 0.09616 -7.67610 7.64810 -0.02800 24.61020 -24.98173 -0.37153
magnitude: 0.38479 au
magnitude: 0.97806 debye
